{"text_format":"2","workbook":"xlsx","n_sheets":6,"sheets":["Projektdaten","Fahrzeuge","Sonderfahrzeuge","Ladeinfrastruktur","spezielle Ladeinfrastruktur","Vorlage für AZA"],"not_rendered":{"charts":0,"images":1,"macros":0,"external_links":0,"defined_names":31,"comments":0,"pivot_tables":1},"unopened":[],"bounds":{"document_bytes":16777216,"sheet_cells":100000,"run_cost":"one","rows_first":2000,"rows_last":500,"rows_between":2000,"halvings":0,"cell_chars":16384,"cell_head_chars":4096},"cells_cut":0,"cells_raw":0,"read":"whole","date_system":"1900"}

{"sheet":"Projektdaten","index":0,"n_rows":50,"n_cols":23,"rows_kept":50,"cut":false,"hidden":false,"merged":[[35,1,43,1],[19,0,19,3],[21,0,49,0],[44,1,49,1],[0,0,0,4],[1,0,1,4],[3,0,17,6],[20,0,20,3],[21,1,25,1],[26,1,34,1]]}
["Tabelle zur Ermittlung der förderfähigen Ausgaben (EfA)"]
["Anlage 2 zum Aufruf zur Antragseinreichung zur Förderung von E-Fahrzeugen und notwendiger Ladeinfrastruktur (02/2021)\n"]
[]
["Mithilfe dieser Tabelle können Sie die Grundlage für Ihre Förderung berechnen. Die Fördersumme berechnet sich aus der Multiplikation der hier berechneten förderfähigen Ausgaben mit der Förderquote. Bitte befüllen Sie diese Anlage, bevor Sie den Antrag in easy-Online ausfüllen. Im Reiter \"Fahrzeuge\" finden Sie als Auswahlfeld alle Fahrzeuge, für die aktuelle Preislisten veröffentlicht wurden. Für diese Fahrzeuge werden Pauschalen ausgezahlt. Nur wenn das Fahrzeug, welches Sie beantragen möchten, nicht darunter ist, können Sie es im Reiter \"Sonderfahrzeuge\" selbst eingeben. Gleiches gilt analog für den Bereich Ladeinfrastruktur.\n\nÜbertragung in easy-Online:\nIm letzten Reiter \"Vorlage für AZA\" finden Sie eine Aufstellung Ihrer Fördergegenstände. Bitte übertragen Sie diese in Ihr easy-Online Formular unter der Rubrik \"Gesamtfinanzierung\". Als \"Preis € / Stück\" werden die förderfähigen Ausgaben aus der EfA-Tabelle eingetragen.\n\nÜbermitteln Sie uns die Tabelle bitte in drei Varianten:\n1. Im pdf-Format als Anhang zum easy-Online Antrag, \n2. als Ausdruck per Post als Anlage zum Antrag sowie\n3. im Excel-Format per E-Mail für die Begleitforschung an: elektromobilitaet@now-gmbh.de"]
{"$rows_empty":15}
["Übersichtsblatt Stammdaten - Bitte tragen Sie Ihre Projektdaten ein"]
["Bitte beantworten Sie diese Fragen wahrheitsgemäß. Diese Angaben haben keinen Einfluss auf die Förderung, \nsie dienen ausschließlich der statistischen Auswertung und Weiterentwicklung des Förderprogramms.",{"$nulls":14},"JAoNEIN","Antragsteller","Raumkategorie","Einsatzkontext","Einsatzgebiet","Standortyp","Beschilderung","E/E"]
["Projekt","Allgemeine Infornationen","Projekt-Kurzbezeichnung (Akronym)",{"$nulls":12},"Ja","gewerblich","Großstadt/Metropolregion > 500.000 EW","Carsharing (fester Stellplatz)","überwiegend städtisch","Firmenparkplatz (Flotte)","Negative Beschilderung mit Zeichen 286,  290.1","nein"]
[null,null,"Projekt-Beschreibung (Titel)",{"$nulls":12},"Nein","kommunal","Großstadt > 100.000 EW","Carsharing (mehrere feste Stellplätze)","überwiegend ländlich","Halböffentlich","Positive Beschilderung mit Zeichen 314, 314.1, 315","PV"]
[null,null,"Ausführende Institution",{"$nulls":14},"Mittelstadt > 50.000 EW","CarSharing (Float)","beides zu gleichen Teilen","Öffentlich am Wohnort","Nein","Wind"]
[null,null,"Raumkategorie",{"$nulls":14},"Kleinstadt > 10.000 EW","Dienstwagen",null,"Öffentlich zentral",null,"PV & Wind"]
[null,null,"Gibt es einen Bezug zu einem aktuell laufenden oder beantragten Forschungs- und Entwicklungsprojekt?",{"$nulls":14},"Stadt/Gemeinde < 10.000 EW","Flotte (Firmen)",null,"Privat"]
[null,"Fahrzeug","Anzahl Fahrzeuge im gesamten Fuhrpark",{"$nulls":14},"Landgemeinde","Flotte (Kommunal)",null,"Firmenparkplatz (private Nutzung)"]
[null,null,"             davon bereits E-Fahrzeuge",{"$nulls":14},"ausserhalb einer Ansiedlung","Flotte (Mietwagen)",null,"Firmen- oder Betriebsgelände "]
[null,null,"Einsatzkontext",{"$nulls":15},"ÖPNV-Flotte"]
[null,null,"Planen sie weitere Umstellungen auf alternative Antriebe innerhalb ihrer Flotte bis 2025 (bezogen auf die Gesamtanzahl in Zeile 27)?",{"$nulls":15},"Privatwagen"]
[null,null,"Falls ja: Anzahl der Umstellung in den kommenden 1-2 Jahren (2021/22)",{"$nulls":15},"Lieferverkehr"]
[null,null,"Falls ja: Anzahl der Umstellung in den darauffolgenden 1-3 Jahren (2023 – 2025)",{"$nulls":15},"Taxi"]
[null,null,"Ersetzen die beantragten E-Fahrzeuge  vorhandene konventionelle Fahrzeuge?",{"$nulls":15},"Leasing"]
[null,null,"Fahren Ihre Fahrzeuge überwiegend im Stadtgebiet?",{"$nulls":15},"Ride-Pooling, Ride-Hailing, Ride-Sharing"]
[null,null,"An wievielen Tagen im Jahr werden die E-Fahrzeuge durchschnittlich im Einsatz sein?",{"$nulls":15},"Kombination"]
[null,"Ladeinfrastruktur","Haben Sie bereits vorhandene Ladeinfrastruktur?"]
[null,null,"Falls ja, wieviele Ladepunkte?"]
[null,null,"Standorttyp der geplanten LIS"]
[null,null,"Wird die LIS öffentlich zugänglich?"]
[null,null,"Planen Sie eine Beschilderung des Parkplatzes?"]
[null,null,"Planen Sie den Parkplatz mit Parkraumsensoren auszustatten?"]
[null,null,"Planen Sie die Errichtung weiterer Ladepunkte?"]
[null,null,"Falls ja: Wie viele Ladepunkte in den kommenden 1-2 Jahren (2021-22)?"]
[null,null,"Falls ja: Wie viele Ladepunkte in den darauffolgenden 1-3 Jahren (2023-25)?"]
[null,"Netzintegration & Erneuerbare Energie","Haben Sie bereits ein Energiemanagement- system zur Steuerung elektrischer Verbraucher im Einsatz?"]
[null,null,"Falls ja: Planen Sie die LIS in das Energiemanagementsystem zu integrieren?"]
[null,null,"Falls nein: Planen Sie die Einführung eines Energiemanagementsystems im Zusammenhang mit der geplanten LIS?"]
[null,null,"Betreiben bzw. nutzen Sie eine PV- bzw. Windkraftanlage zur lokalen, dezentralen Stromerzeugung?"]
[null,null,"Falls ja: Planen Sie die lokal erzeugte erneuerbare Energie zum Laden der E-Fahrzeuge zu nutzen?"]
[null,null,"Planen Sie die Anschaffung bzw. Erweiterung der lokalen erneuerabren Energieerzeugung in Zusammenhang mit der neuen LIS?"]

{"sheet":"Fahrzeuge","index":1,"n_rows":266,"n_cols":35,"rows_kept":266,"cut":false,"hidden":false,"merged":[[5,0,5,1],[6,0,6,1],[7,0,7,1]]}
["Tabelle zur Ermittlung der förderfähigen Ausgaben (EfA)",null,null,null,"ja","nein","Stand: 09.09.2021",null,null,null,"FKZ: 03EMI4"]
["Hinweise:",{"$nulls":5},"ergänzt: 17.04.2024"]
["Die Registerkarte 'Vorlage für AZA' stellt Ihre Eingaben so dar, wie sie in das easyOnline-Formular eingetragen werden müssen.",{"$nulls":5},"korrigiert: 17.04.2024"]
[]
["Bitte füllen Sie zunächst die folgenden Auswahlfelder aus:"]
["Antragsteller ist vorsteuerabzugsberechtigt [Auswahlbox]:"]
["Antragsteller ist zur Ausschreibung verpflichtet [Auswahbox]:"]
["Antragsteller ist selbst antragsberechtigt für \nden BaFa-Umweltbonus [Auswahbox]:"]
["Wählen Sie in der Liste unten die gewünschten Fahrzeuge (Auswahlbox) und die entsprechende Anzahl aus. Geben Sie die zu erwartende durchschnittliche Jahresfahrleistung pro Fahrzeug an."]
["Für Ladeinfrastruktur und Sonderfahrzeuge wählen Sie bitte die entsprechenden Registerkarten."]
["Speichern Sie die ausgefüllten Arbeitsblätter als PDF und fügen Sie sie dem Antrag bei."]
["Grün unterlegte Felder sind Eingabefelder."]
[]
["Pos.","Typ E-Fahrzeug\n[Auswahlbox]","Fahrzeugsegment nach Kraftfahrt-Bundesamt",{"$f":"IF(Fahrzeuge!$C$6=\"nein\",\"Bruttopreis\nE-Fahrzeug\",IF(Fahrzeuge!$C$6=\"ja\",\"Nettopreis\nE-Fahrzeug\",\"Bitte wählen sie aus, ob sie zum Vorsteuerabzug berechtigt sind!\"))","v":"Bitte wählen sie aus, ob sie zum Vorsteuerabzug berechtigt sind!"},"Typ Referenzfahrzeug",{"$f":"IF(Fahrzeuge!$C$6=\"nein\",\"Bruttopreis\nReferenzfahrzeug\",IF(Fahrzeuge!$C$6=\"ja\",\"Nettopreis\nReferenzfahrzeug\",\"Bitte wählen sie aus, ob sie zum Vorsteuerabzug berechtigt sind!\"))","v":"Bitte wählen sie aus, ob sie zum Vorsteuerabzug berechtigt sind!"},{"$f":"IF($C$6=\"nein\",\"Förderfähige Ausgaben pro Fahrzeug (brutto)\",IF($C$6=\"ja\",\"Förderfähige Ausgaben pro Fahrzeug (netto)\",\"Bitte wählen sie aus, ob sie zum Vorsteuerabzug berechtigt sind!\"))","v":"Bitte wählen sie aus, ob sie zum Vorsteuerabzug berechtigt sind!"},{"$f":"IF($C$8=\"ja\",\"Information*: \"&G14&\" nach Anrechnung des Umweltbonus\",\"\")","v":""},"Anzahl zu beschaffender Fahrzeuge des Typs","erwartete durchschnittliche Jahres- Fahrleistung pro Fahrzeug in km","Förderfähige Ausgaben ","Korrekturfeld PtJ",{"$nulls":22},"Fahrzeugklasse Abkürzungen"]
[1,null,{"$f":" IF(B15>0,CONCATENATE(VLOOKUP(B15,N40:W249,9,0),\" (\",VLOOKUP(B15,N40:W249,10,0),\")\"),\"\")","v":""},{"$f":"IF($B15>0,IF(Fahrzeuge!$C$6=\"nein\",VLOOKUP($B15,$N$40:$U$249,3,0),IF(Fahrzeuge!$C$6=\"ja\",VLOOKUP($B15,$N$40:$U$249,2,0),\"Bitte wählen sie aus, ob sie zum Vorsteuerabzug berechtigt sind!\")),\"\")","v":""},{"$f":"IF($B15>0,VLOOKUP($B15,$N$40:$U$249,4,0),\"\")","v":""},{"$f":"IF($B15>0,IF(Fahrzeuge!$C$6=\"nein\",VLOOKUP($B15,$N$40:$U$249,6,0),IF(Fahrzeuge!$C$6=\"ja\",VLOOKUP($B15,$N$40:$U$249,5,0),\"Bitte wählen sie aus, ob sie zum Vorsteuerabzug berechtigt sind!\")),\"\")","v":""},{"$f":"IF(B15>0,IF($C$6=\"nein\",VLOOKUP($B15,$N$40:$U$249,8,0),IF($C$6=\"ja\",VLOOKUP($B15,$N$40:$U$249,7,0),\"Bitte wählen sie aus, ob sie zum Vorsteuerabzug berechtigt sind!\")),\"\")","v":""},{"$f":"IF($H$14>\"\",IF(B15>0,IF($C$6=\"nein\",VLOOKUP($B15,$N$40:$AA$243,14,0),IF($C$6=\"ja\",VLOOKUP($B15,$N$40:$AA$243,13,0),\"\")),\"\"),\"\")","v":""},null,null,{"$f":"IF(B15>0,G15*I15,\"\")","v":""}]
[{"$f":"A15+1","v":2},null,{"$f":" IF(B16>0,CONCATENATE(VLOOKUP(B16,N40:W249,9,0),\" (\",VLOOKUP(B16,N40:W249,10,0),\")\"),\"\")","v":""},{"$f":"IF($B16>0,IF(Fahrzeuge!$C$6=\"nein\",VLOOKUP($B16,$N$40:$U$249,3,0),IF(Fahrzeuge!$C$6=\"ja\",VLOOKUP($B16,$N$40:$U$249,2,0),\"Bitte wählen sie aus, ob sie zum Vorsteuerabzug berechtigt sind!\")),\"\")","v":""},{"$f":"IF($B16>0,VLOOKUP($B16,$N$40:$U$249,4,0),\"\")","v":""},{"$f":"IF($B16>0,IF(Fahrzeuge!$C$6=\"nein\",VLOOKUP($B16,$N$40:$U$249,6,0),IF(Fahrzeuge!$C$6=\"ja\",VLOOKUP($B16,$N$40:$U$249,5,0),\"Bitte wählen sie aus, ob sie zum Vorsteuerabzug berechtigt sind!\")),\"\")","v":""},{"$f":"IF(B16>0,IF($C$6=\"nein\",VLOOKUP($B16,$N$40:$U$249,8,0),IF($C$6=\"ja\",VLOOKUP($B16,$N$40:$U$249,7,0),\"Bitte wählen sie aus, ob sie zum Vorsteuerabzug berechtigt sind!\")),\"\")","v":""},{"$f":"IF($H$14>\"\",IF(B16>0,IF($C$6=\"nein\",VLOOKUP($B16,$N$40:$AA$243,14,0),IF($C$6=\"ja\",VLOOKUP($B16,$N$40:$AA$243,13,0),\"\")),\"\"),\"\")","v":""},null,null,""]
[{"$f":"A16+1","v":3},null,{"$f":" IF(B17>0,CONCATENATE(VLOOKUP(B17,N40:W249,9,0),\" (\",VLOOKUP(B17,N40:W249,10,0),\")\"),\"\")","v":""},{"$f":"IF($B17>0,IF(Fahrzeuge!$C$6=\"nein\",VLOOKUP($B17,$N$40:$U$249,3,0),IF(Fahrzeuge!$C$6=\"ja\",VLOOKUP($B17,$N$40:$U$249,2,0),\"Bitte wählen sie aus, ob sie zum Vorsteuerabzug berechtigt sind!\")),\"\")","v":""},{"$f":"IF($B17>0,VLOOKUP($B17,$N$40:$U$249,4,0),\"\")","v":""},{"$f":"IF($B17>0,IF(Fahrzeuge!$C$6=\"nein\",VLOOKUP($B17,$N$40:$U$249,6,0),IF(Fahrzeuge!$C$6=\"ja\",VLOOKUP($B17,$N$40:$U$249,5,0),\"Bitte wählen sie aus, ob sie zum Vorsteuerabzug berechtigt sind!\")),\"\")","v":""},{"$f":"IF(B17>0,IF($C$6=\"nein\",VLOOKUP($B17,$N$40:$U$249,8,0),IF($C$6=\"ja\",VLOOKUP($B17,$N$40:$U$249,7,0),\"Bitte wählen sie aus, ob sie zum Vorsteuerabzug berechtigt sind!\")),\"\")","v":""},{"$f":"IF($H$14>\"\",IF(B17>0,IF($C$6=\"nein\",VLOOKUP($B17,$N$40:$AA$243,14,0),IF($C$6=\"ja\",VLOOKUP($B17,$N$40:$AA$243,13,0),\"\")),\"\"),\"\")","v":""},null,null,""]
[{"$f":"A17+1","v":4},null,{"$f":" IF(B18>0,CONCATENATE(VLOOKUP(B18,N40:W249,9,0),\" (\",VLOOKUP(B18,N40:W249,10,0),\")\"),\"\")","v":""},{"$f":"IF($B18>0,IF(Fahrzeuge!$C$6=\"nein\",VLOOKUP($B18,$N$40:$U$249,3,0),IF(Fahrzeuge!$C$6=\"ja\",VLOOKUP($B18,$N$40:$U$249,2,0),\"Bitte wählen sie aus, ob sie zum Vorsteuerabzug berechtigt sind!\")),\"\")","v":""},{"$f":"IF($B18>0,VLOOKUP($B18,$N$40:$U$249,4,0),\"\")","v":""},{"$f":"IF($B18>0,IF(Fahrzeuge!$C$6=\"nein\",VLOOKUP($B18,$N$40:$U$249,6,0),IF(Fahrzeuge!$C$6=\"ja\",VLOOKUP($B18,$N$40:$U$249,5,0),\"Bitte wählen sie aus, ob sie zum Vorsteuerabzug berechtigt sind!\")),\"\")","v":""},{"$f":"IF(B18>0,IF($C$6=\"nein\",VLOOKUP($B18,$N$40:$U$249,8,0),IF($C$6=\"ja\",VLOOKUP($B18,$N$40:$U$249,7,0),\"Bitte wählen sie aus, ob sie zum Vorsteuerabzug berechtigt sind!\")),\"\")","v":""},{"$f":"IF($H$14>\"\",IF(B18>0,IF($C$6=\"nein\",VLOOKUP($B18,$N$40:$AA$243,14,0),IF($C$6=\"ja\",VLOOKUP($B18,$N$40:$AA$243,13,0),\"\")),\"\"),\"\")","v":""},null,null,""]
[{"$f":"A18+1","v":5},null,{"$f":" IF(B19>0,CONCATENATE(VLOOKUP(B19,N40:W249,9,0),\" (\",VLOOKUP(B19,N40:W249,10,0),\")\"),\"\")","v":""},{"$f":"IF($B19>0,IF(Fahrzeuge!$C$6=\"nein\",VLOOKUP($B19,$N$40:$U$249,3,0),IF(Fahrzeuge!$C$6=\"ja\",VLOOKUP($B19,$N$40:$U$249,2,0),\"Bitte wählen sie aus, ob sie zum Vorsteuerabzug berechtigt sind!\")),\"\")","v":""},{"$f":"IF($B19>0,VLOOKUP($B19,$N$40:$U$249,4,0),\"\")","v":""},{"$f":"IF($B19>0,IF(Fahrzeuge!$C$6=\"nein\",VLOOKUP($B19,$N$40:$U$249,6,0),IF(Fahrzeuge!$C$6=\"ja\",VLOOKUP($B19,$N$40:$U$249,5,0),\"Bitte wählen sie aus, ob sie zum Vorsteuerabzug berechtigt sind!\")),\"\")","v":""},{"$f":"IF(B19>0,IF($C$6=\"nein\",VLOOKUP($B19,$N$40:$U$249,8,0),IF($C$6=\"ja\",VLOOKUP($B19,$N$40:$U$249,7,0),\"Bitte wählen sie aus, ob sie zum Vorsteuerabzug berechtigt sind!\")),\"\")","v":""},{"$f":"IF($H$14>\"\",IF(B19>0,IF($C$6=\"nein\",VLOOKUP($B19,$N$40:$AA$243,14,0),IF($C$6=\"ja\",VLOOKUP($B19,$N$40:$AA$243,13,0),\"\")),\"\"),\"\")","v":""},null,null,""]
[{"$f":"A19+1","v":6},null,{"$f":" IF(B20>0,CONCATENATE(VLOOKUP(B20,N40:W249,9,0),\" (\",VLOOKUP(B20,N40:W249,10,0),\")\"),\"\")","v":""},{"$f":"IF($B20>0,IF(Fahrzeuge!$C$6=\"nein\",VLOOKUP($B20,$N$40:$U$249,3,0),IF(Fahrzeuge!$C$6=\"ja\",VLOOKUP($B20,$N$40:$U$249,2,0),\"Bitte wählen sie aus, ob sie zum Vorsteuerabzug berechtigt sind!\")),\"\")","v":""},{"$f":"IF($B20>0,VLOOKUP($B20,$N$40:$U$249,4,0),\"\")","v":""},{"$f":"IF($B20>0,IF(Fahrzeuge!$C$6=\"nein\",VLOOKUP($B20,$N$40:$U$249,6,0),IF(Fahrzeuge!$C$6=\"ja\",VLOOKUP($B20,$N$40:$U$249,5,0),\"Bitte wählen sie aus, ob sie zum Vorsteuerabzug berechtigt sind!\")),\"\")","v":""},{"$f":"IF(B20>0,IF($C$6=\"nein\",VLOOKUP($B20,$N$40:$U$249,8,0),IF($C$6=\"ja\",VLOOKUP($B20,$N$40:$U$249,7,0),\"Bitte wählen sie aus, ob sie zum Vorsteuerabzug berechtigt sind!\")),\"\")","v":""},{"$f":"IF($H$14>\"\",IF(B20>0,IF($C$6=\"nein\",VLOOKUP($B20,$N$40:$AA$243,14,0),IF($C$6=\"ja\",VLOOKUP($B20,$N$40:$AA$243,13,0),\"\")),\"\"),\"\")","v":""},null,null,""]
[7,null,{"$f":" IF(B21>0,CONCATENATE(VLOOKUP(B21,N40:W249,9,0),\" (\",VLOOKUP(B21,N40:W249,10,0),\")\"),\"\")","v":""},{"$f":"IF($B21>0,IF(Fahrzeuge!$C$6=\"nein\",VLOOKUP($B21,$N$40:$U$249,3,0),IF(Fahrzeuge!$C$6=\"ja\",VLOOKUP($B21,$N$40:$U$249,2,0),\"Bitte wählen sie aus, ob sie zum Vorsteuerabzug berechtigt sind!\")),\"\")","v":""},{"$f":"IF($B21>0,VLOOKUP($B21,$N$40:$U$249,4,0),\"\")","v":""},{"$f":"IF($B21>0,IF(Fahrzeuge!$C$6=\"nein\",VLOOKUP($B21,$N$40:$U$249,6,0),IF(Fahrzeuge!$C$6=\"ja\",VLOOKUP($B21,$N$40:$U$249,5,0),\"Bitte wählen sie aus, ob sie zum Vorsteuerabzug berechtigt sind!\")),\"\")","v":""},{"$f":"IF(B21>0,IF($C$6=\"nein\",VLOOKUP($B21,$N$40:$U$249,8,0),IF($C$6=\"ja\",VLOOKUP($B21,$N$40:$U$249,7,0),\"Bitte wählen sie aus, ob sie zum Vorsteuerabzug berechtigt sind!\")),\"\")","v":""},{"$f":"IF($H$14>\"\",IF(B21>0,IF($C$6=\"nein\",VLOOKUP($B21,$N$40:$AA$243,14,0),IF($C$6=\"ja\",VLOOKUP($B21,$N$40:$AA$243,13,0),\"\")),\"\"),\"\")","v":""},null,null,""]
[8,null,{"$f":" IF(B22>0,CONCATENATE(VLOOKUP(B22,N40:W249,9,0),\" (\",VLOOKUP(B22,N40:W249,10,0),\")\"),\"\")","v":""},{"$f":"IF($B22>0,IF(Fahrzeuge!$C$6=\"nein\",VLOOKUP($B22,$N$40:$U$249,3,0),IF(Fahrzeuge!$C$6=\"ja\",VLOOKUP($B22,$N$40:$U$249,2,0),\"Bitte wählen sie aus, ob sie zum Vorsteuerabzug berechtigt sind!\")),\"\")","v":""},{"$f":"IF($B22>0,VLOOKUP($B22,$N$40:$U$249,4,0),\"\")","v":""},{"$f":"IF($B22>0,IF(Fahrzeuge!$C$6=\"nein\",VLOOKUP($B22,$N$40:$U$249,6,0),IF(Fahrzeuge!$C$6=\"ja\",VLOOKUP($B22,$N$40:$U$249,5,0),\"Bitte wählen sie aus, ob sie zum Vorsteuerabzug berechtigt sind!\")),\"\")","v":""},{"$f":"IF(B22>0,IF($C$6=\"nein\",VLOOKUP($B22,$N$40:$U$249,8,0),IF($C$6=\"ja\",VLOOKUP($B22,$N$40:$U$249,7,0),\"Bitte wählen sie aus, ob sie zum Vorsteuerabzug berechtigt sind!\")),\"\")","v":""},{"$f":"IF($H$14>\"\",IF(B22>0,IF($C$6=\"nein\",VLOOKUP($B22,$N$40:$AA$243,14,0),IF($C$6=\"ja\",VLOOKUP($B22,$N$40:$AA$243,13,0),\"\")),\"\"),\"\")","v":""},null,null,""]
[{"$f":"A22+1","v":9},null,{"$f":" IF(B23>0,CONCATENATE(VLOOKUP(B23,N40:W249,9,0),\" (\",VLOOKUP(B23,N40:W249,10,0),\")\"),\"\")","v":""},{"$f":"IF($B23>0,IF(Fahrzeuge!$C$6=\"nein\",VLOOKUP($B23,$N$40:$U$249,3,0),IF(Fahrzeuge!$C$6=\"ja\",VLOOKUP($B23,$N$40:$U$249,2,0),\"Bitte wählen sie aus, ob sie zum Vorsteuerabzug berechtigt sind!\")),\"\")","v":""},{"$f":"IF($B23>0,VLOOKUP($B23,$N$40:$U$249,4,0),\"\")","v":""},{"$f":"IF($B23>0,IF(Fahrzeuge!$C$6=\"nein\",VLOOKUP($B23,$N$40:$U$249,6,0),IF(Fahrzeuge!$C$6=\"ja\",VLOOKUP($B23,$N$40:$U$249,5,0),\"Bitte wählen sie aus, ob sie zum Vorsteuerabzug berechtigt sind!\")),\"\")","v":""},{"$f":"IF(B23>0,IF($C$6=\"nein\",VLOOKUP($B23,$N$40:$U$249,8,0),IF($C$6=\"ja\",VLOOKUP($B23,$N$40:$U$249,7,0),\"Bitte wählen sie aus, ob sie zum Vorsteuerabzug berechtigt sind!\")),\"\")","v":""},{"$f":"IF($H$14>\"\",IF(B23>0,IF($C$6=\"nein\",VLOOKUP($B23,$N$40:$AA$243,14,0),IF($C$6=\"ja\",VLOOKUP($B23,$N$40:$AA$243,13,0),\"\")),\"\"),\"\")","v":""},null,null,""]
[10,null,{"$f":" IF(B24>0,CONCATENATE(VLOOKUP(B24,N40:W249,9,0),\" (\",VLOOKUP(B24,N40:W249,10,0),\")\"),\"\")","v":""},{"$f":"IF($B24>0,IF(Fahrzeuge!$C$6=\"nein\",VLOOKUP($B24,$N$40:$U$249,3,0),IF(Fahrzeuge!$C$6=\"ja\",VLOOKUP($B24,$N$40:$U$249,2,0),\"Bitte wählen sie aus, ob sie zum Vorsteuerabzug berechtigt sind!\")),\"\")","v":""},{"$f":"IF($B24>0,VLOOKUP($B24,$N$40:$U$249,4,0),\"\")","v":""},{"$f":"IF($B24>0,IF(Fahrzeuge!$C$6=\"nein\",VLOOKUP($B24,$N$40:$U$249,6,0),IF(Fahrzeuge!$C$6=\"ja\",VLOOKUP($B24,$N$40:$U$249,5,0),\"Bitte wählen sie aus, ob sie zum Vorsteuerabzug berechtigt sind!\")),\"\")","v":""},{"$f":"IF(B24>0,IF($C$6=\"nein\",VLOOKUP($B24,$N$40:$U$249,8,0),IF($C$6=\"ja\",VLOOKUP($B24,$N$40:$U$249,7,0),\"Bitte wählen sie aus, ob sie zum Vorsteuerabzug berechtigt sind!\")),\"\")","v":""},{"$f":"IF($H$14>\"\",IF(B24>0,IF($C$6=\"nein\",VLOOKUP($B24,$N$40:$AA$243,14,0),IF($C$6=\"ja\",VLOOKUP($B24,$N$40:$AA$243,13,0),\"\")),\"\"),\"\")","v":""},null,null,""]
[11,null,{"$f":" IF(B25>0,CONCATENATE(VLOOKUP(B25,N40:W249,9,0),\" (\",VLOOKUP(B25,N40:W249,10,0),\")\"),\"\")","v":""},{"$f":"IF($B25>0,IF(Fahrzeuge!$C$6=\"nein\",VLOOKUP($B25,$N$40:$U$249,3,0),IF(Fahrzeuge!$C$6=\"ja\",VLOOKUP($B25,$N$40:$U$249,2,0),\"Bitte wählen sie aus, ob sie zum Vorsteuerabzug berechtigt sind!\")),\"\")","v":""},{"$f":"IF($B25>0,VLOOKUP($B25,$N$40:$U$249,4,0),\"\")","v":""},{"$f":"IF($B25>0,IF(Fahrzeuge!$C$6=\"nein\",VLOOKUP($B25,$N$40:$U$249,6,0),IF(Fahrzeuge!$C$6=\"ja\",VLOOKUP($B25,$N$40:$U$249,5,0),\"Bitte wählen sie aus, ob sie zum Vorsteuerabzug berechtigt sind!\")),\"\")","v":""},{"$f":"IF(B25>0,IF($C$6=\"nein\",VLOOKUP($B25,$N$40:$U$249,8,0),IF($C$6=\"ja\",VLOOKUP($B25,$N$40:$U$249,7,0),\"Bitte wählen sie aus, ob sie zum Vorsteuerabzug berechtigt sind!\")),\"\")","v":""},{"$f":"IF($H$14>\"\",IF(B25>0,IF($C$6=\"nein\",VLOOKUP($B25,$N$40:$AA$243,14,0),IF($C$6=\"ja\",VLOOKUP($B25,$N$40:$AA$243,13,0),\"\")),\"\"),\"\")","v":""},null,null,""]
[12,null,{"$f":" IF(B26>0,CONCATENATE(VLOOKUP(B26,N40:W249,9,0),\" (\",VLOOKUP(B26,N40:W249,10,0),\")\"),\"\")","v":""},{"$f":"IF($B26>0,IF(Fahrzeuge!$C$6=\"nein\",VLOOKUP($B26,$N$40:$U$249,3,0),IF(Fahrzeuge!$C$6=\"ja\",VLOOKUP($B26,$N$40:$U$249,2,0),\"Bitte wählen sie aus, ob sie zum Vorsteuerabzug berechtigt sind!\")),\"\")","v":""},{"$f":"IF($B26>0,VLOOKUP($B26,$N$40:$U$249,4,0),\"\")","v":""},{"$f":"IF($B26>0,IF(Fahrzeuge!$C$6=\"nein\",VLOOKUP($B26,$N$40:$U$249,6,0),IF(Fahrzeuge!$C$6=\"ja\",VLOOKUP($B26,$N$40:$U$249,5,0),\"Bitte wählen sie aus, ob sie zum Vorsteuerabzug berechtigt sind!\")),\"\")","v":""},{"$f":"IF(B26>0,IF($C$6=\"nein\",VLOOKUP($B26,$N$40:$U$249,8,0),IF($C$6=\"ja\",VLOOKUP($B26,$N$40:$U$249,7,0),\"Bitte wählen sie aus, ob sie zum Vorsteuerabzug berechtigt sind!\")),\"\")","v":""},{"$f":"IF($H$14>\"\",IF(B26>0,IF($C$6=\"nein\",VLOOKUP($B26,$N$40:$AA$243,14,0),IF($C$6=\"ja\",VLOOKUP($B26,$N$40:$AA$243,13,0),\"\")),\"\"),\"\")","v":""},null,null,""]
[{"$f":"A26+1","v":13},null,{"$f":" IF(B27>0,CONCATENATE(VLOOKUP(B27,N40:W249,9,0),\" (\",VLOOKUP(B27,N40:W249,10,0),\")\"),\"\")","v":""},{"$f":"IF($B27>0,IF(Fahrzeuge!$C$6=\"nein\",VLOOKUP($B27,$N$40:$U$249,3,0),IF(Fahrzeuge!$C$6=\"ja\",VLOOKUP($B27,$N$40:$U$249,2,0),\"Bitte wählen sie aus, ob sie zum Vorsteuerabzug berechtigt sind!\")),\"\")","v":""},{"$f":"IF($B27>0,VLOOKUP($B27,$N$40:$U$249,4,0),\"\")","v":""},{"$f":"IF($B27>0,IF(Fahrzeuge!$C$6=\"nein\",VLOOKUP($B27,$N$40:$U$249,6,0),IF(Fahrzeuge!$C$6=\"ja\",VLOOKUP($B27,$N$40:$U$249,5,0),\"Bitte wählen sie aus, ob sie zum Vorsteuerabzug berechtigt sind!\")),\"\")","v":""},{"$f":"IF(B27>0,IF($C$6=\"nein\",VLOOKUP($B27,$N$40:$U$249,8,0),IF($C$6=\"ja\",VLOOKUP($B27,$N$40:$U$249,7,0),\"Bitte wählen sie aus, ob sie zum Vorsteuerabzug berechtigt sind!\")),\"\")","v":""},{"$f":"IF($H$14>\"\",IF(B27>0,IF($C$6=\"nein\",VLOOKUP($B27,$N$40:$AA$243,14,0),IF($C$6=\"ja\",VLOOKUP($B27,$N$40:$AA$243,13,0),\"\")),\"\"),\"\")","v":""},null,null,""]
[14,null,{"$f":" IF(B28>0,CONCATENATE(VLOOKUP(B28,N40:W249,9,0),\" (\",VLOOKUP(B28,N40:W249,10,0),\")\"),\"\")","v":""},{"$f":"IF($B28>0,IF(Fahrzeuge!$C$6=\"nein\",VLOOKUP($B28,$N$40:$U$249,3,0),IF(Fahrzeuge!$C$6=\"ja\",VLOOKUP($B28,$N$40:$U$249,2,0),\"Bitte wählen sie aus, ob sie zum Vorsteuerabzug berechtigt sind!\")),\"\")","v":""},{"$f":"IF($B28>0,VLOOKUP($B28,$N$40:$U$249,4,0),\"\")","v":""},{"$f":"IF($B28>0,IF(Fahrzeuge!$C$6=\"nein\",VLOOKUP($B28,$N$40:$U$249,6,0),IF(Fahrzeuge!$C$6=\"ja\",VLOOKUP($B28,$N$40:$U$249,5,0),\"Bitte wählen sie aus, ob sie zum Vorsteuerabzug berechtigt sind!\")),\"\")","v":""},{"$f":"IF(B28>0,IF($C$6=\"nein\",VLOOKUP($B28,$N$40:$U$249,8,0),IF($C$6=\"ja\",VLOOKUP($B28,$N$40:$U$249,7,0),\"Bitte wählen sie aus, ob sie zum Vorsteuerabzug berechtigt sind!\")),\"\")","v":""},{"$f":"IF($H$14>\"\",IF(B28>0,IF($C$6=\"nein\",VLOOKUP($B28,$N$40:$AA$243,14,0),IF($C$6=\"ja\",VLOOKUP($B28,$N$40:$AA$243,13,0),\"\")),\"\"),\"\")","v":""},null,null,""]
[15,null,{"$f":" IF(B29>0,CONCATENATE(VLOOKUP(B29,N40:W249,9,0),\" (\",VLOOKUP(B29,N40:W249,10,0),\")\"),\"\")","v":""},{"$f":"IF($B29>0,IF(Fahrzeuge!$C$6=\"nein\",VLOOKUP($B29,$N$40:$U$249,3,0),IF(Fahrzeuge!$C$6=\"ja\",VLOOKUP($B29,$N$40:$U$249,2,0),\"Bitte wählen sie aus, ob sie zum Vorsteuerabzug berechtigt sind!\")),\"\")","v":""},{"$f":"IF($B29>0,VLOOKUP($B29,$N$40:$U$249,4,0),\"\")","v":""},{"$f":"IF($B29>0,IF(Fahrzeuge!$C$6=\"nein\",VLOOKUP($B29,$N$40:$U$249,6,0),IF(Fahrzeuge!$C$6=\"ja\",VLOOKUP($B29,$N$40:$U$249,5,0),\"Bitte wählen sie aus, ob sie zum Vorsteuerabzug berechtigt sind!\")),\"\")","v":""},{"$f":"IF(B29>0,IF($C$6=\"nein\",VLOOKUP($B29,$N$40:$U$249,8,0),IF($C$6=\"ja\",VLOOKUP($B29,$N$40:$U$249,7,0),\"Bitte wählen sie aus, ob sie zum Vorsteuerabzug berechtigt sind!\")),\"\")","v":""},{"$f":"IF($H$14>\"\",IF(B29>0,IF($C$6=\"nein\",VLOOKUP($B29,$N$40:$AA$243,14,0),IF($C$6=\"ja\",VLOOKUP($B29,$N$40:$AA$243,13,0),\"\")),\"\"),\"\")","v":""},null,null,""]
[16,null,{"$f":" IF(B30>0,CONCATENATE(VLOOKUP(B30,N40:W249,9,0),\" (\",VLOOKUP(B30,N40:W249,10,0),\")\"),\"\")","v":""},{"$f":"IF($B30>0,IF(Fahrzeuge!$C$6=\"nein\",VLOOKUP($B30,$N$40:$U$249,3,0),IF(Fahrzeuge!$C$6=\"ja\",VLOOKUP($B30,$N$40:$U$249,2,0),\"Bitte wählen sie aus, ob sie zum Vorsteuerabzug berechtigt sind!\")),\"\")","v":""},{"$f":"IF($B30>0,VLOOKUP($B30,$N$40:$U$249,4,0),\"\")","v":""},{"$f":"IF($B30>0,IF(Fahrzeuge!$C$6=\"nein\",VLOOKUP($B30,$N$40:$U$249,6,0),IF(Fahrzeuge!$C$6=\"ja\",VLOOKUP($B30,$N$40:$U$249,5,0),\"Bitte wählen sie aus, ob sie zum Vorsteuerabzug berechtigt sind!\")),\"\")","v":""},{"$f":"IF(B30>0,IF($C$6=\"nein\",VLOOKUP($B30,$N$40:$U$249,8,0),IF($C$6=\"ja\",VLOOKUP($B30,$N$40:$U$249,7,0),\"Bitte wählen sie aus, ob sie zum Vorsteuerabzug berechtigt sind!\")),\"\")","v":""},{"$f":"IF($H$14>\"\",IF(B30>0,IF($C$6=\"nein\",VLOOKUP($B30,$N$40:$AA$243,14,0),IF($C$6=\"ja\",VLOOKUP($B30,$N$40:$AA$243,13,0),\"\")),\"\"),\"\")","v":""},null,null,""]
[{"$f":"A30+1","v":17},null,{"$f":" IF(B31>0,CONCATENATE(VLOOKUP(B31,N40:W249,9,0),\" (\",VLOOKUP(B31,N40:W249,10,0),\")\"),\"\")","v":""},{"$f":"IF($B31>0,IF(Fahrzeuge!$C$6=\"nein\",VLOOKUP($B31,$N$40:$U$249,3,0),IF(Fahrzeuge!$C$6=\"ja\",VLOOKUP($B31,$N$40:$U$249,2,0),\"Bitte wählen sie aus, ob sie zum Vorsteuerabzug berechtigt sind!\")),\"\")","v":""},{"$f":"IF($B31>0,VLOOKUP($B31,$N$40:$U$249,4,0),\"\")","v":""},{"$f":"IF($B31>0,IF(Fahrzeuge!$C$6=\"nein\",VLOOKUP($B31,$N$40:$U$249,6,0),IF(Fahrzeuge!$C$6=\"ja\",VLOOKUP($B31,$N$40:$U$249,5,0),\"Bitte wählen sie aus, ob sie zum Vorsteuerabzug berechtigt sind!\")),\"\")","v":""},{"$f":"IF(B31>0,IF($C$6=\"nein\",VLOOKUP($B31,$N$40:$U$249,8,0),IF($C$6=\"ja\",VLOOKUP($B31,$N$40:$U$249,7,0),\"Bitte wählen sie aus, ob sie zum Vorsteuerabzug berechtigt sind!\")),\"\")","v":""},{"$f":"IF($H$14>\"\",IF(B31>0,IF($C$6=\"nein\",VLOOKUP($B31,$N$40:$AA$243,14,0),IF($C$6=\"ja\",VLOOKUP($B31,$N$40:$AA$243,13,0),\"\")),\"\"),\"\")","v":""},null,null,""]
[{"$f":"A31+1","v":18},null,{"$f":" IF(B32>0,CONCATENATE(VLOOKUP(B32,N40:W249,9,0),\" (\",VLOOKUP(B32,N40:W249,10,0),\")\"),\"\")","v":""},{"$f":"IF($B32>0,IF(Fahrzeuge!$C$6=\"nein\",VLOOKUP($B32,$N$40:$U$249,3,0),IF(Fahrzeuge!$C$6=\"ja\",VLOOKUP($B32,$N$40:$U$249,2,0),\"Bitte wählen sie aus, ob sie zum Vorsteuerabzug berechtigt sind!\")),\"\")","v":""},{"$f":"IF($B32>0,VLOOKUP($B32,$N$40:$U$249,4,0),\"\")","v":""},{"$f":"IF($B32>0,IF(Fahrzeuge!$C$6=\"nein\",VLOOKUP($B32,$N$40:$U$249,6,0),IF(Fahrzeuge!$C$6=\"ja\",VLOOKUP($B32,$N$40:$U$249,5,0),\"Bitte wählen sie aus, ob sie zum Vorsteuerabzug berechtigt sind!\")),\"\")","v":""},{"$f":"IF(B32>0,IF($C$6=\"nein\",VLOOKUP($B32,$N$40:$U$249,8,0),IF($C$6=\"ja\",VLOOKUP($B32,$N$40:$U$249,7,0),\"Bitte wählen sie aus, ob sie zum Vorsteuerabzug berechtigt sind!\")),\"\")","v":""},{"$f":"IF($H$14>\"\",IF(B32>0,IF($C$6=\"nein\",VLOOKUP($B32,$N$40:$AA$243,14,0),IF($C$6=\"ja\",VLOOKUP($B32,$N$40:$AA$243,13,0),\"\")),\"\"),\"\")","v":""},null,null,""]
[{"$f":"A32+1","v":19},null,{"$f":" IF(B33>0,CONCATENATE(VLOOKUP(B33,N40:W249,9,0),\" (\",VLOOKUP(B33,N40:W249,10,0),\")\"),\"\")","v":""},{"$f":"IF($B33>0,IF(Fahrzeuge!$C$6=\"nein\",VLOOKUP($B33,$N$40:$U$249,3,0),IF(Fahrzeuge!$C$6=\"ja\",VLOOKUP($B33,$N$40:$U$249,2,0),\"Bitte wählen sie aus, ob sie zum Vorsteuerabzug berechtigt sind!\")),\"\")","v":""},{"$f":"IF($B33>0,VLOOKUP($B33,$N$40:$U$249,4,0),\"\")","v":""},{"$f":"IF($B33>0,IF(Fahrzeuge!$C$6=\"nein\",VLOOKUP($B33,$N$40:$U$249,6,0),IF(Fahrzeuge!$C$6=\"ja\",VLOOKUP($B33,$N$40:$U$249,5,0),\"Bitte wählen sie aus, ob sie zum Vorsteuerabzug berechtigt sind!\")),\"\")","v":""},{"$f":"IF(B33>0,IF($C$6=\"nein\",VLOOKUP($B33,$N$40:$U$249,8,0),IF($C$6=\"ja\",VLOOKUP($B33,$N$40:$U$249,7,0),\"Bitte wählen sie aus, ob sie zum Vorsteuerabzug berechtigt sind!\")),\"\")","v":""},{"$f":"IF($H$14>\"\",IF(B33>0,IF($C$6=\"nein\",VLOOKUP($B33,$N$40:$AA$243,14,0),IF($C$6=\"ja\",VLOOKUP($B33,$N$40:$AA$243,13,0),\"\")),\"\"),\"\")","v":""},null,null,""]
[{"$f":"A33+1","v":20},null,{"$f":" IF(B34>0,CONCATENATE(VLOOKUP(B34,N40:W249,9,0),\" (\",VLOOKUP(B34,N40:W249,10,0),\")\"),\"\")","v":""},{"$f":"IF($B34>0,IF(Fahrzeuge!$C$6=\"nein\",VLOOKUP($B34,$N$40:$U$249,3,0),IF(Fahrzeuge!$C$6=\"ja\",VLOOKUP($B34,$N$40:$U$249,2,0),\"Bitte wählen sie aus, ob sie zum Vorsteuerabzug berechtigt sind!\")),\"\")","v":""},{"$f":"IF($B34>0,VLOOKUP($B34,$N$40:$U$249,4,0),\"\")","v":""},{"$f":"IF($B34>0,IF(Fahrzeuge!$C$6=\"nein\",VLOOKUP($B34,$N$40:$U$249,6,0),IF(Fahrzeuge!$C$6=\"ja\",VLOOKUP($B34,$N$40:$U$249,5,0),\"Bitte wählen sie aus, ob sie zum Vorsteuerabzug berechtigt sind!\")),\"\")","v":""},{"$f":"IF(B34>0,IF($C$6=\"nein\",VLOOKUP($B34,$N$40:$U$249,8,0),IF($C$6=\"ja\",VLOOKUP($B34,$N$40:$U$249,7,0),\"Bitte wählen sie aus, ob sie zum Vorsteuerabzug berechtigt sind!\")),\"\")","v":""},{"$f":"IF($H$14>\"\",IF(B34>0,IF($C$6=\"nein\",VLOOKUP($B34,$N$40:$AA$243,14,0),IF($C$6=\"ja\",VLOOKUP($B34,$N$40:$AA$243,13,0),\"\")),\"\"),\"\")","v":""},null,null,""]
["Summe",null,null,null,{"$f":"IF($B35>0,VLOOKUP($B35,$N$61:$U$218,5,0),\"\")","v":""},null,{"$f":"IF(B35>0,IF($C$6=\"nein\",VLOOKUP($B35,$N$61:$U$218,9,0),IF($C$6=\"ja\",VLOOKUP($B35,$N$61:$U$218,8,0),\"Bitte wählen sie aus, ob sie zum Vorsteuerabzug berechtigt sind!\")),\"\")","v":""},null,{"$f":"IF(COUNTA(I15:I34)=COUNTA(J15:J34),\"\",\"Anzahl oder Fahrleistungs-angabe fehlt\")","v":""},{"$f":"IFERROR(\"Ø: \"&TEXT(SUMPRODUCT(I15:I34,J15:J34)/SUM(I15:I34),\"#.##0\"),\"\")","v":""},{"$f":"IF(SUM(K15:K34)>0,SUM(K15:K34),\"\")","v":""}]
[]
[null,{"$f":" IF(C7>0, IF(C7=\"nein\",\"\",\"* Bei Beantragung von Fahrzeugsegmenten erfolgt die Abrechnung nach den Pauschalwerten des tatsächlich beschafften Fahrzeugs!\"),\"\")","v":""}]
[null,{"$f":"IF(H14>\"\",\"* Die Informationsspalte zum Umweltbonus zeigt, auf welche förderfähigen Mehrkosten sich unsere Förderung bezieht, sofern sie selbst den Umweltbonus beantragen. (siehe FAQ Frage 24)\",\"\")","v":""}]
[null,null," ",{"$nulls":10},"E-Fahrzeug","E-Listenpreis netto","E-Listenpreis brutto","Vergleichsfahrzeug","Listenpreis netto","Listenpreis brutto","förderfähig netto","förderfähig brutto","Info Segment","Fahrzeugklassen Abkürzung","ergänzt am:","BAFA","förderfähig netto abzgl. BaFa","förderfähig brutto abzgl. BaFa","Kommentar",null,null,null,"Ausschreibung?",{"$f":"IF(Fahrzeuge!$C$7>0,IF(Fahrzeuge!$C$7=\"ja\",\"ja\",\"nein\"),\"\")","v":""}]
[{"$nulls":12},"Änderung Name zu 500e am 17.04.24","Abarth 500e",{"$f":"ROUND(P40/1.19,2)","v":36134.449999999997},43000,"Abarth 595",{"$f":"ROUND(S40/1.19,2)","v":23521.01},27990,{"$f":"IF(O40-R40>=0,ROUND(O40-R40,0),0)","v":12613},15010,"Kleinwagen","PKW","2024-04-17",{"$f":"IF(O40>=40000,5000,6000)","v":6000},{"$f":"IF(T40-Y40>0,T40-Y40,0)","v":6613},{"$f":"IF(U40-Y40>0,U40-Y40,0)","v":9010}]
[{"$nulls":13},"AIWAYS U5 (alle Versionen)",{"$f":"(35403+3000)/1.19","v":32271.428571428572},{"$f":"ROUND(O41*1.19,2)","v":38403},"VW Tiguan Life 1.5 TSI OPF  Gang 110 kW",{"$f":"ROUND(29901.68/1.16,2)","v":25777.31},{"$f":"ROUND(R41*1.19,2)","v":30675},{"$f":"ROUND(O41-R41,0)","v":6494},{"$f":"ROUND(P41-S41,0)","v":7728},"Geländewagen / SUV","PKW","2021-06-22",{"$f":"IF(O41>=40000,5000,6000)","v":6000},{"$f":"IF(T41-Y41>0,T41-Y41,0)","v":494},{"$f":"IF(U41-Y41>0,U41-Y41,0)","v":1728}]
[{"$nulls":13},"Aixam eCity",{"$f":"ROUND(P42/1.19,2)","v":12092.44},14390,"Aixam City Pack",{"$f":"ROUND(S42/1.19,2)","v":9382.35},11165,{"$f":"ROUND(O42-R42,0)","v":2710},{"$f":"ROUND(P42-S42,0)","v":3225},"Leichtfahrzeug","LFZ","2020-12-22",null,null,null,"ursprünglicher Preis vom Smart, eigentlich 11.290 EUR"]
[{"$nulls":13},"Alfa Romeo Junior Elettrica (alle Versionen)",33193.279999999999,39500,"Alfa Romeo Junior Ibrida",{"$f":"ROUND(S43/1.19,2)","v":24789.919999999998},29500,{"$f":"IF(O43-R43>=0,ROUND(O43-R43,0),0)","v":8403},10000,"Geländewagen / SUV","PKW","2024-04-17"]
[{"$nulls":13},"ARI 345",6995,{"$f":"6995*1.19","v":8324.0499999999993},"Kymco Maxxer S300 T ONROAD LOF (Quad)",{"$f":"ROUND(S44/1.19,2)","v":4957.1400000000003},5899,{"$f":"IF(O44-R44>=0,ROUND(O44-R44,0),0)","v":2038},2425,"Leichtfahrzeug","LFZ","2023-09-06"]
[{"$nulls":13},"ARI 252 / 452",9999,{"$f":"9999*1.19","v":11898.81},"Aixam Minauto Access",8394.9599999999991,9990,1604,1909,"Leichtfahrzeug","LFZ","2023-09-06"]
[{"$nulls":13},"ARI 458 (150 km)",17690,{"$f":"(14790+2900)*1.19","v":21051.1},"Aixam D-Truck Pritsche",13100.84,15590,4589,5461,"Leichtfahrzeug","LFZ","2023-09-06"]
[{"$nulls":13},"ARI 458 (200 km)",18690,{"$f":"(14790+3900)*1.19","v":22241.1},"Aixam D-Truck Pritsche",13100.84,15590,5589,6651,"Leichtfahrzeug","LFZ","2023-09-06"]
[{"$nulls":13},"ARI 802 (150 km)",13899,{"$f":"(10999+2900)*1.19","v":16539.809999999998},"Aixam City Pack",10075.629999999999,11990,3823,4550,"Leichtfahrzeug","LFZ","2023-09-06"]
[{"$nulls":13},"ARI 802 (200 km)",14899,{"$f":"(10999+3900)*1.19","v":17729.809999999998},"Aixam City Pack",10075.629999999999,11990,4823,5740,"Leichtfahrzeug","LFZ","2023-09-06"]
[{"$nulls":13},"ARI 902 (9,5 kWh)",13990,{"$f":"13990*1.19","v":16648.099999999999},"Aixam City Pack",10075.629999999999,11990,3914,4658,"Leichtfahrzeug","LFZ","2023-09-06"]
[{"$nulls":13},"ARI 902 (10,35 kWh)",14980,{"$f":"(13990+990)*1.19","v":17826.2},"Aixam City Pack",10075.629999999999,11990,4904,5836,"Leichtfahrzeug","LFZ","2023-09-06"]
[{"$nulls":13},"ARI 902 (18 kWh)",15960,{"$f":"(13990+1970)*1.19","v":18992.399999999998},"Aixam City Pack",10075.629999999999,11990,5884,7002,"Leichtfahrzeug","LFZ","2023-09-06"]
[{"$nulls":13},"Audi e-tron 50 quattro (alle Versionen)",58067.23,{"$f":"ROUND(O53*1.19,2)","v":69100},"Audi A6 allroad quattro 45 TDI 170 kW",{"$f":"ROUND(60524.71/1.16,2)","v":52176.47},{"$f":"ROUND(R53*1.19,2)","v":62090},{"$f":"ROUND(O53-R53,0)","v":5891},7010,"Geländewagen / SUV","PKW","2020-12-17",{"$f":"IF(O53>=40000,5000,6000)","v":5000},{"$f":"IF(T53-Y53>0,T53-Y53,0)","v":891},{"$f":"IF(U53-Y53>0,U53-Y53,0)","v":2010}]
[{"$nulls":13},"Audi e-tron 55 quattro (alle Versionen)","nicht förderfähig gemäß Aufruf","nicht förderfähig gemäß Aufruf",null,{"$f":"ROUND(S54/1.19,2)","v":0},null,null,null,"Geländewagen / SUV","PKW","2020-12-17",0,0,0]
[{"$nulls":13},"Audi e-tron GT","nicht förderfähig gemäß Aufruf","nicht förderfähig gemäß Aufruf",null,0,0,0,0,"Geländewagen / SUV","PKW","2021-09-09",0,0,0]
[{"$nulls":13},"Audi Q4 e-tron 55 kWh (alle Versionen)",35210.080000000002,{"$f":"ROUND(O56*1.19,2)","v":41900},"Audi Q3 35 TFSI 6-Gang 110 kW",30294.12,{"$f":"ROUND(R56*1.19,2)","v":36050},{"$f":"ROUND(O56-R56,0)","v":4916},{"$f":"ROUND(P56-S56,0)","v":5850},"Geländewagen / SUV","PKW","2021-09-07",{"$f":"IF(O56>=40000,5000,6000)","v":6000},0,0]
[{"$nulls":13},"Audi Q4 e-tron 82 kWh (alle Versionen)",39915.97,{"$f":"ROUND(O57*1.19,2)","v":47500},"Audi Q3 35 TFSI 6-Gang 110 kW",30294.12,{"$f":"ROUND(R57*1.19,2)","v":36050},{"$f":"ROUND(O57-R57,0)","v":9622},{"$f":"ROUND(P57-S57,0)","v":11450},"Geländewagen / SUV","PKW","2021-09-07",6000,3622,5450]
[{"$nulls":13},"Audi Q6 e-tron 100 kWh (alle Versionen)",{"$f":"ROUND(P58/1.19,2)","v":62773.11},74700,"Audi Q5 advanced 45 TFSI quattro S tronic",{"$f":"ROUND(S58/1.19,2)","v":50588.24},60200,{"$f":"IF(O58-R58>=0,ROUND(O58-R58,0),0)","v":12185},14500,"Geländewagen / SUV","PKW","2024-04-03"]
[{"$nulls":12},"Änderung 25.01.2024","Audi Q8 e-tron 50 quattro 89 kWh (alle Versionen)",{"$f":"ROUND(P59/1.19,2)","v":62521.01},74400,"Audi A6 allroad quattro 45 TDI 180 kW",{"$f":"ROUND(S59/1.19,2)","v":55966.39},66600,{"$f":"IF(O59-R59>=0,ROUND(O59-R59,0),0)","v":6555},7800,"Geländewagen / SUV","PKW","2023-09-06",5000,{"$f":"IF(T59-Y59>0,T59-Y59,0)","v":1555},{"$f":"IF(U59-Y59>0,U59-Y59,0)","v":2800}]
[{"$nulls":13},"Audi Q8 e-tron 55 quattro (alle Versionen)","nicht förderfähig gemäß Aufruf","nicht förderfähig gemäß Aufruf",null,{"$f":"ROUND(S60/1.19,2)","v":0},0,null,null,"Geländewagen / SUV","PKW"]
[{"$nulls":13},"BMW i3 (120Ah, alle Versionen)",32773.11,{"$f":"O61*1.19","v":39000.000899999999},"BMW 218 i Active Tourer",25042.02,{"$f":"R61*1.19","v":29800.003799999999},{"$f":"ROUND(O61-R61,0)","v":7731},9200,"Kompaktklasse","PKW","2020-12-17",6000,1731,3200]
[{"$nulls":13},"BMW i4 (alle Versionen)",{"$f":"ROUND(P62/1.19,2)","v":47478.99},56500,"BMW 420i Gran Coupé ",{"$f":"ROUND(S62/1.19,2)","v":43193.279999999999},51400,{"$f":"IF(O62-R62>=0,ROUND(O62-R62,0),0)","v":4286},{"$f":"IF(P62-S62>=0,ROUND(P62-S62,0),0)","v":5100},"Mittelklasse","PKW","2024-02-19",5000,{"$f":"IF(T62-Y62>0,T62-Y62,0)","v":0},{"$f":"IF(U62-Y62>0,U62-Y62,0)","v":100}]
[{"$nulls":13},"BMW i5 (alle Versionen)",{"$f":"ROUND(P63/1.19,2)","v":58991.6},70200,"BMW 520d",{"$f":"ROUND(S63/1.19,2)","v":50210.080000000002},59750,{"$f":"IF(O63-R63>=0,ROUND(O63-R63,0),0)","v":8782},10450,"Mittelklasse","PKW","2024-02-19",{"$f":"IF(O63>=40000,5000,6000)","v":5000},{"$f":"IF(T63-Y63>0,T63-Y63,0)","v":3782},{"$f":"IF(U63-Y63>0,U63-Y63,0)","v":5450}]
[{"$nulls":13},"BMW i7 (alle Versionen)","nicht förderfähig gemäß FRL","nicht förderfähig gemäß Aufruf",null,{"$f":"ROUND(S64/1.19,2)","v":0},0,null,null,"Oberklasse","PKW"]
[{"$nulls":13},"BMW iX1 (alle Versionen)",{"$f":"ROUND(P65/1.19,2)","v":46218.49},55000,"BMW X1 xDrive20d",{"$f":"ROUND(S65/1.19,2)","v":40714.29},48450,{"$f":"IF(O65-R65>=0,ROUND(O65-R65,0),0)","v":5504},6550,"Geländewagen / SUV","PKW","2023-09-06",5000,{"$f":"IF(T65-Y65>0,T65-Y65,0)","v":504},{"$f":"IF(U65-Y65>0,U65-Y65,0)","v":1550}]
[{"$nulls":13},"BMW iX2 (alle Versionen)",{"$f":"ROUND(P66/1.19,2)","v":47478.99},56500,"BMW X2 xDrive20d",{"$f":"ROUND(S66/1.19,2)","v":41974.79},49950,{"$f":"IF(O66-R66>=0,ROUND(O66-R66,0),0)","v":5504},{"$f":"IF(P66-S66>=0,ROUND(P66-S66,0),0)","v":6550},"Geländewagen / SUV","PKW","2024-02-14",{"$f":"IF(O66>=40000,5000,6000)","v":5000},{"$f":"IF(T66-Y66>0,T66-Y66,0)","v":504},{"$f":"IF(U66-Y66>0,U66-Y66,0)","v":1550}]
[{"$nulls":13},"BMW iX3 (210 kW)",54159.66,{"$f":"ROUND(O67*1.19,2)","v":64450},"BMW X3 xDrive30i",{"$f":"ROUND(53028.56/1.16,2)","v":45714.28},{"$f":"ROUNDUP(R67*1.19,2)","v":54400},8445,10050,"Geländewagen / SUV","PKW","2020-12-17",5000,{"$f":"IF(T67-Y67>0,T67-Y67,0)","v":3445},{"$f":"IF(U67-Y67>0,U67-Y67,0)","v":5050}]
[{"$nulls":13},"BMW iX (alle Versionen)",{"$f":"ROUND(P68/1.19,2)","v":64957.98},77300,"BMW X5 xDrive30d",{"$f":"ROUND(S68/1.19,2)","v":72521.009999999995},86300,{"$f":"IF(O68-R68>=0,ROUND(O68-R68,0),0)","v":0},0,"Geländewagen / SUV","PKW","2024-04-17",{"$f":"IF(O68>=40000,5000,6000)","v":5000},{"$f":"IF(T68-Y68>0,T68-Y68,0)","v":0},{"$f":"IF(U68-Y68>0,U68-Y68,0)","v":0}]
[{"$nulls":13},"BYD Atto 3 (alle Versionen)",{"$f":"ROUND(P69/1.19,2)","v":37500},44625,"Mazda CX 5",{"$f":"ROUND(S69/1.19,2)","v":25201.68},{"$f":"ROUND(25201.68*1.19,2)","v":29990},{"$f":"IF(O69-R69>=0,ROUND(O69-R69,0),0)","v":12298},14635,"Kompaktklasse","PKW","2023-09-06",6000,6298,8635]
[{"$nulls":13},"BYD Dolphin 60,4 kWh (alle Versionen)",{"$f":"ROUND(P70/1.19,2)","v":27722.69},32990,"Peugeot 308 PureTech 130",{"$f":"ROUND(S70/1.19,2)","v":26260.5},31250,{"$f":"IF(O70-R70>=0,ROUND(O70-R70,0),0)","v":1462},{"$f":"IF(P70-S70>=0,ROUND(P70-S70,0),0)","v":1740},"Kompaktklasse","PKW","2024-02-15",{"$f":"IF(O70>=40000,5000,6000)","v":6000},{"$f":"IF(T70-Y70>0,T70-Y70,0)","v":0},{"$f":"IF(U70-Y70>0,U70-Y70,0)","v":0}]
[{"$nulls":13},"BYD Han (alle Versionen)",59500,{"$f":"ROUND(59500*1.19,2)","v":70805},"Mercedes Benz E 300 d 4MATIC",{"$f":"ROUND(S71/1.19,2)","v":51565},61362.35,7935,9443,"Mittelklasse","PKW","2023-09-06",5000,2935,4443]
[{"$nulls":13},"BYD Seal (alle Versionen)",{"$f":"ROUND(P72/1.19,2)","v":37806.720000000001},44990,"Opel Insignia 90 kW",{"$f":"ROUND(S72/1.19,2)","v":32142.86},38250,{"$f":"IF(O72-R72>=0,ROUND(O72-R72,0),0)","v":5664},{"$f":"IF(P72-S72>=0,ROUND(P72-S72,0),0)","v":6740},"Mittelklasse","PKW",null,{"$f":"IF(O72>=40000,5000,6000)","v":6000},{"$f":"IF(T72-Y72>0,T72-Y72,0)","v":0},{"$f":"IF(U72-Y72>0,U72-Y72,0)","v":740}]
[{"$nulls":13},"BYD Tang (alle Versionen)",60000,{"$f":"ROUND(60000*1.19,2)","v":71400},"Toyota Land Cruiser (7-Sitzer)",{"$f":"ROUND(S73/1.19,2)","v":47705.88},56770,12294,14630,"Geländewagen / SUV","PKW","2023-09-06",5000,7294,9630]
[{"$nulls":13},"Cenntro Metro (13 kWh), L7e",{"$f":"ROUND(P74/1.19,2)","v":21176.47},25200,"Aixam D-Truck Pritsche",{"$f":"ROUND(S74/1.19,2)","v":13100.84},15590,8076,9610,"Leichtfahrzeug","LFZ","2023-09-06"]
[{"$nulls":13},"Citroën ë-Berlingo (alle Versionen)",{"$f":"ROUND(36590/1.19,2)","v":30747.9},{"$f":"ROUND(O75*1.19,2)","v":36590},"Citroën Berlingo Feel 81 kW",{"$f":"ROUND(23740/1.19,2)","v":19949.580000000002},{"$f":"R75*1.19","v":23740.000200000002},10798,12850,"Großraum-Van","PKW","2021-06-23",{"$f":"IF(O75>=40000,5000,6000)","v":6000},{"$f":"IF(T75-Y75>0,T75-Y75,0)","v":4798},{"$f":"IF(U75-Y75>0,U75-Y75,0)","v":6850}]
[{"$nulls":13},"CITROËN C-Zero",{"$f":"ROUND(P76/1.19,2)","v":18319.330000000002},21800,"Citroën C1 Cti 68 (5 Türer)",{"$f":"ROUND(S76/1.19,2)","v":8907.56},10600,9412,11200,"Mini","PKW",null,6000,3412,5200]
[{"$nulls":13},"CITROËN ë-C3 (alle Versionen)",{"$f":"ROUND(P77/1.19,2)","v":19579.830000000002},23300,"CITROËN C3 PureTech 83",{"$f":"ROUND(S77/1.19,2)","v":10831.93},12890,{"$f":"IF(O77-R77>=0,ROUND(O77-R77,0),0)","v":8748},{"$f":"IF(P77-S77>=0,ROUND(P77-S77,0),0)","v":10410},"Kleinwagen","PKW","2024-02-14",{"$f":"IF(O77>=40000,5000,6000)","v":6000},{"$f":"IF(T77-Y77>0,T77-Y77,0)","v":2748},{"$f":"IF(U77-Y77>0,U77-Y77,0)","v":4410}]
[{"$nulls":13},"CITROËN e-C4",{"$f":"34640/1.19","v":29109.243697478993},34640,"CITROËN C4 PureTech 130 6-Gang",{"$f":"23940/1.19","v":20117.647058823532},{"$f":"ROUNDUP(R78*1.19,2)","v":23940},8992,10700,"Kompaktklasse","PKW","2020-12-17",6000,2992,4700]
[{"$nulls":13},"CITROËN E-Mehari",{"$f":"ROUND(P79/1.19,2)","v":21235.29},25270,"Fiat 500c",{"$f":"ROUND(S79/1.19,2)","v":12764.71},15190,8471,10080,"Kleinwagen","PKW",null,6000,2471,4080]
[{"$nulls":13},"CITROËN ë-SpaceTourer 50kWh (nur M1-Versionen)",{"$f":"ROUND(51440/1.19,2)","v":43226.89},{"$f":"O80*1.19","v":51439.999099999994},"CITROËN SpaceTourer M BlueHDi 145 (Business)",{"$f":"ROUND(39340/1.19,2)","v":33058.82},{"$f":"R80*1.19","v":39339.995799999997},{"$f":"ROUND(O80-R80,0)","v":10168},12100,"Großraum-Van","PKW","2021-01-10",5000,5168,7100]
[{"$nulls":13},"CITROËN ë-SpaceTourer 75kWh (nur M1-Versionen)",{"$f":"ROUND(57440/1.19,2)","v":48268.91},{"$f":"O81*1.19","v":57440.002899999999},"CITROËN SpaceTourer M BlueHDi 145 (Business)",{"$f":"ROUND(39340/1.19,2)","v":33058.82},39339.995799999997,15210,18100,"Großraum-Van","PKW","2021-01-10",5000,{"$f":"IF(T81-Y81>0,T81-Y81,0)","v":10210},{"$f":"IF(U81-Y81>0,U81-Y81,0)","v":13100}]
[{"$nulls":13},"CITROËN ë-Jumpy Kombi 50kWh  (nur M1-Versionen)",{"$f":"ROUND(P82/1.19,2)","v":42176.47},50190,"Citroen Jumpy Kombi (alle M-Versionen)",{"$f":"ROUND(S82/1.19,2)","v":33605.040000000001},39990,{"$f":"IF(O82-R82>=0,ROUND(O82-R82,0),0)","v":8571},10200,"Großraum-Van","PKW","2023-09-06",5000,3571,5200]
[{"$nulls":13},"CITROËN ë-Jumpy Kombi 75kWh  (nur M1-Versionen)",47218.49,56190,"Citroen Jumpy Kombi (alle M-Versionen)",33605.040000000001,39990,13613,16200,"Großraum-Van","PKW","2023-09-06",5000,8613,11200]
[{"$nulls":13},"CUPRA born 58kWh (alle Versionen)",{"$f":"ROUND(P84/1.19,2)","v":32579.83},38770,"Seat Leon FR 110 kW ",{"$f":"ROUND(S84/1.19,2)","v":25075.63},29840,7504,8930,"Kompaktklasse","PKW","2023-09-06",6000,1504,2930]
[{"$nulls":13},"CUPRA born 77kWh (alle Versionen)",{"$f":"ROUND(P85/1.19,2)","v":38529.410000000003},45850,"Seat Leon FR 110 kW ",{"$f":"ROUND(S85/1.19,2)","v":25075.63},29840,13454,16010,"Kompaktklasse","PKW","2023-09-06",6000,7454,10010]
[{"$nulls":13},"CITROËN DS3 Crossback E-Tense",32512.61,{"$f":"ROUNDDOWN(O86*1.19,2)","v":38690},"DS3 Crossback PureTech 130 So Chic (N)",24607.56,{"$f":"ROUND(R86*1.19,2)","v":29283},{"$f":"ROUND(O86-R86,0)","v":7905},{"$f":"ROUND(P86-S86,0)","v":9407},"Geländewagen / SUV","PKW","2020-12-22",{"$f":"IF(O86>=40000,5000,6000)","v":6000},1905,3407]
[{"$nulls":13},"Dacia Spring (alle Versionen)",{"$f":"ROUND(P87/1.19,2)","v":19117.650000000001},22750,"Dacia Sandero Stepway",{"$f":"ROUND(S87/1.19,2)","v":12100.84},14400,{"$f":"IF(O87-R87>=0,ROUND(O87-R87,0),0)","v":7017},8350,"Mini","PKW","2023-09-06",6000,{"$f":"IF(T87-Y87>0,T87-Y87,0)","v":1017},{"$f":"IF(U87-Y87>0,U87-Y87,0)","v":2350}]
[{"$nulls":13},"e.GO-Life 20",{"$f":"ROUND(P88/1.19,2)","v":13361.34},15899.99,"Hyundai i10",{"$f":"ROUND(S88/1.19,2)","v":8394.9599999999991},9990,{"$f":"ROUND(O88-R88,0)","v":4966},5910,"Mini","PKW",null,6000,0,0]
[{"$nulls":13},"e.GO-Life 40",{"$f":"ROUND(P89/1.19,2)","v":14621.85},17400,"Hyundai i10",{"$f":"ROUND(S89/1.19,2)","v":8394.9599999999991},9990,6227,7410,"Mini","PKW",null,6000,227,1410]
[{"$nulls":13},"e.GO-Life 60",{"$f":"ROUND(P90/1.19,2)","v":16722.689999999999},19900,"Hyundai i10",{"$f":"ROUND(S90/1.19,2)","v":8394.9599999999991},9990,8328,9910,"Mini","PKW",null,6000,2328,3910]
[{"$nulls":13},"Elaris BEO (alle Versionen)",{"$f":"ROUND(P91/1.19,2)","v":36739.5},{"$f":"39220+4500","v":43720},"VW Tiguan Life 1.5 TSI OPF  6 Gang 110 kW",{"$f":"ROUND(S91/1.19,2)","v":31121.85},37035,{"$f":"IF(O91-R91>=0,ROUND(O91-R91,0),0)","v":5618},6685,"Geländewagen / SUV","PKW","2023-09-06",6000,{"$f":"IF(T91-Y91>0,T91-Y91,0)","v":0},{"$f":"IF(U91-Y91>0,U91-Y91,0)","v":685}]
[{"$nulls":13},"Elaris DYO (alle Versionen)",17924.37,{"$f":"16830+4500","v":21330},"Ligier JS60 CHIC",{"$f":"ROUND(S92/1.19,2)","v":14284.87},16999,3640,4331,"Mini","PKW","2023-09-06",6000,0,0]
[{"$nulls":13},"Elaris PIO (alle Versionen)",15403.36,{"$f":"13830+4500","v":18330},"Ligier JS50 Club",11344.54,13500,4059,4830,"Mini","PKW","2023-09-06",6000,0,0]
[{"$nulls":12},"zuordnung Fzg-kl. Am 21.02.2024 geändert","Fiat 500 elektro 23,8 kWh (alle Versionen)",26042.02,30990,"Fiat 500 Hybrid",14277.31,16990,11765,14000,"Mini","PKW",null,6000,5765,8000]
[{"$nulls":12},"zuordnung Fzg-kl. Am 21.02.2024 geändert","Fiat 500 elektro 42,0 kWh (alle Versionen)",29403.360000000001,34990,"Fiat 500 Hybrid",14277.31,16990,15126,18000,"Mini","PKW",null,6000,9126,12000]
[{"$nulls":13},"Fiat 600 e 54 kWh (alle Versionen)",{"$f":"ROUND(P96/1.19,2)","v":30663.87},36490,"Fiat 600 Hybrid",{"$f":"ROUND(S96/1.19,2)","v":21000},24990,{"$f":"IF(O96-R96>=0,ROUND(O96-R96,0),0)","v":9664},{"$f":"IF(P96-S96>=0,ROUND(P96-S96,0),0)","v":11500},"Kompaktklasse","PKW","2024-02-14",{"$f":"IF(O96>=40000,5000,6000)","v":6000},{"$f":"IF(T96-Y96>0,T96-Y96,0)","v":3664},{"$f":"IF(U96-Y96>0,U96-Y96,0)","v":5500}]
[{"$nulls":13},"Fiat E-Doblò (nur M1 Versionen)",{"$f":"ROUND(P97/1.19,2)","v":31550},37544.5,"Fiat Doblò",{"$f":"ROUND(S97/1.19,2)","v":21100},25109,{"$f":"IF(O97-R97>=0,ROUND(O97-R97,0),0)","v":10450},12436,"Großraum-Van","PKW","2023-09-06",6000,{"$f":"IF(T97-Y97>0,T97-Y97,0)","v":4450},{"$f":"IF(U97-Y97>0,U97-Y97,0)","v":6436}]
[{"$nulls":13},"Fiat E-Ducato Kombi 35 L2H2 47 kWh (nur M1-Versionen)",58500,{"$f":"O98*1.19","v":69615},"Fiat Maxi Hochraumkombi 35",40550,{"$f":"R98*1.19","v":48254.5},17950,21361,"Großraum-Van","PKW","2020-12-22",5000,12950,16361]
[{"$nulls":13},"Fiat E-Ducato Kombi 35 L2H2 79 kWh (nur M1-Versionen)",75500,{"$f":"O99*1.19","v":89845},"Fiat Maxi Hochraumkombi 35",40550,{"$f":"R99*1.19","v":48254.5},34950,41591,"Großraum-Van","PKW","2020-12-22",5000,29950,36591]
[{"$nulls":13},"Fiat E-Ulysse 50 kWh (nur M1-Versionen)",{"$f":"ROUND(P100/1.19,2)","v":52932.77},62990,"Toyota Proace Verso 106 kW, L1-Version ",{"$f":"ROUND(S100/1.19,2)","v":44302.52},52720,{"$f":"IF(O100-R100>=0,ROUND(O100-R100,0),0)","v":8630},10270,"Großraum-Van","PKW","2023-09-06",5000,{"$f":"IF(T100-Y100>0,T100-Y100,0)","v":3630},{"$f":"IF(U100-Y100>0,U100-Y100,0)","v":5270}]
[{"$nulls":13},"Fiat E-Ulysse 75 kWh (nur M1-Versionen)",57974.79,68990,"Toyota Proace Verso 106 kW, L1-Version ",44302.52,52720,13672,16270,"Großraum-Van","PKW","2023-09-06",5000,8672,11270]
[{"$nulls":13},"Fisker Ocean 75 kWh (alle Versionen)",34923.949999999997,{"$f":"38882+(ROUND(2250*1.19,2))","v":41559.5},"VW Tiguan Allspace Life 1.5 TSI",34176.47,40670,747,890,"Geländewagen / SUV","PKW","2023-09-06",6000,0,0]
[{"$nulls":13},"Fisker Ocean 100 kWh (alle Versionen)",47899.58,{"$f":"54323+(ROUND(2250*1.19,2))","v":57000.5},"VW Tiguan Allspace Life 2.0 TSI 4 MOTION",39953.78,47545,7946,9456,"Geländewagen / SUV","PKW","2023-09-06",5000,2946,4456]
[{"$nulls":13},"Ford Explorer  EV Extended Range (alle Versionen)",41596.639999999999,49500,"Ford Kuga 110 kW, 6-Gang",33571.43,39950,8025,9550,"Geländewagen / SUV","PKW","2024-03-26",{"$f":"IF(O104>=40000,5000,6000)","v":5000},{"$f":"IF(T104-Y104>0,T104-Y104,0)","v":3025},{"$f":"IF(U104-Y104>0,U104-Y104,0)","v":4550}]
[{"$nulls":13},"Ford Mustang Mach-E Standard Range 75,7 kWh (alle Versionen)",{"$f":"46900/1.19","v":39411.764705882357},46900,"Ford Mondeo 2,0l EcoBlue Limousine  110 kW",{"$f":"36554.62/1.16","v":31512.603448275866},{"$f":"ROUND(R105*1.19,2)","v":37500},7899,9400,"Geländewagen / SUV","PKW","2020-12-17",6000,1899,3400]
[{"$nulls":13},"Ford Mustang Mach-E Extended Range 98,7 kWh (alle Versionen)",{"$f":"54475/1.19","v":45777.310924369747},54475,"Ford Mondeo 2,0l EcoBlue Limousine  110 kW",{"$f":"36554.62/1.16","v":31512.603448275866},37500,14265,16975,"Geländewagen / SUV","PKW","2020-12-17",5000,9265,11975]
[{"$nulls":13},"Ford Tourneo Custom Bus 82,5 kWh (alle Versionen)",{"$f":"ROUND(P107/1.19,2)","v":56150},66818.5,"Ford Tourneo Custom Bus",{"$f":"ROUND(S107/1.19,2)","v":42850},50991.5,{"$f":"IF(O107-R107>=0,ROUND(O107-R107,0),0)","v":13300},{"$f":"IF(P107-S107>=0,ROUND(P107-S107,0),0)","v":15827},"Großraum-Van","PKW","2024-02-14",{"$f":"IF(O107>=40000,5000,6000)","v":5000},{"$f":"IF(T107-Y107>0,T107-Y107,0)","v":8300},{"$f":"IF(U107-Y107>0,U107-Y107,0)","v":10827}]
[{"$nulls":13},"Genesis GV60 (alle Versionen)",{"$f":"ROUND(P108/1.19,2)","v":53109.24},63200,"Hyundai Tucson Allrad, 169 kW (Prime)",{"$f":"ROUND(S108/1.19,2)","v":40361.339999999997},48030,{"$f":"IF(O108-R108>=0,ROUND(O108-R108,0),0)","v":12748},15170,"Geländewagen / SUV","PKW","2023-09-06",5000,{"$f":"IF(T108-Y108>0,T108-Y108,0)","v":7748},{"$f":"IF(U108-Y108>0,U108-Y108,0)","v":10170}]
[{"$nulls":13},"Genesis ELECTRIFIED GV70 (alle Versionen)",56554.62,67300,"Genesis GV70 Sport",43739.5,52050,12815,15250,"Geländewagen / SUV","PKW","2023-09-06",5000,7815,10250]
[{"$nulls":13},"Genesis ELECTRIFIED G80 (alle Versionen)",60672.27,72200,"Genesis G80 Luxury",49899.16,59380,10773,12820,"Mittelklasse","PKW","2023-09-06",5000,5773,7820]
[{"$nulls":13},"Goupil G2 5,2 kWh L7e (alle Versionen)",22456.04,{"$f":"ROUND(22456.04*1.19,2)","v":26722.69},"Aixam D-Truck Pritsche",13100.84,15590,9355,11133,"Leichtfahrzeug","LFZ","2023-09-06"]
[{"$nulls":13},"Goupil G2 8,6 kWh L7e (alle Versionen)",24933.38,{"$f":"ROUND(24933.38*1.19,2)","v":29670.720000000001},"Aixam D-Truck Pritsche",13100.84,15590,11833,14081,"Leichtfahrzeug","LFZ","2023-09-06"]
[{"$nulls":13},"Goupil G4 9 kWh L7e (alle Versionen)",36235.1,{"$f":"ROUND(36235.1*1.19,2)","v":43119.77},"Piaggio Porter SR LPG",18600,22134,17635,20986,"Leichtfahrzeug","LFZ","2023-09-06"]
[{"$nulls":13},"Goupil G4 13,8 kWh L7e (alle Versionen)",41098.1,{"$f":"ROUND(41098.1*1.19,2)","v":48906.74},"Piaggio Porter SR LPG",18600,22134,22498,26773,"Leichtfahrzeug","LFZ","2023-09-06"]
[{"$nulls":12},"Bezeichnung geändert 19.02.2024","GWM Ora 03 300 48 kWh (ehem. Funky Cat, alle Versionen)",{"$f":"ROUND(P115/1.19,2)","v":32764.71},38990,"VW Golf Life 1.5 TSI OPF 6-Gang 110 kW",{"$f":"ROUND(S115/1.19,2)","v":26907.56},32020,{"$f":"IF(O115-R115>=0,ROUND(O115-R115,0),0)","v":5857},6970,"Kompaktklasse","PKW","2023-09-06",{"$f":"IF(O115>=40000,5000,6000)","v":6000},{"$f":"IF(T115-Y115>0,T115-Y115,0)","v":0},{"$f":"IF(U115-Y115>0,U115-Y115,0)","v":970}]
[{"$nulls":12},"Bezeichnung geändert 19.02.2024","GWM Ora 03 400 63 kWh (ehem. Funky Cat, alle Versionen)",{"$f":"ROUND(P116/1.19,2)","v":37386.550000000003},44490,"VW Golf Life 1.5 TSI OPF 6-Gang 110 kW",26907.56,32020,10479,12470,"Kompaktklasse","PKW","2023-09-06",{"$f":"IF(O116>=40000,5000,6000)","v":6000},{"$f":"IF(T116-Y116>0,T116-Y116,0)","v":4479},{"$f":"IF(U116-Y116>0,U116-Y116,0)","v":6470}]
[{"$nulls":12},"zuordnung Fzg-kl. Am 21.02.2024 geändert","Honda e (alle Versionen)",{"$f":"ROUND(P117/1.19,2)","v":33529.410000000003},39900,"Honda Jazz 1.5 i-MMD 80 kW",20042.02,23850,13487,16050,"Kleinwagen","PKW","2020-12-17",6000,7487,10050]
[{"$nulls":13},"Honda e:Ny1 68,8 kWh (alle Versionen)",{"$f":"ROUND(P118/1.19,2)","v":39991.599999999999},47590,"Honda HR-V",{"$f":"ROUND(S118/1.19,2)","v":30252.1},36000,{"$f":"IF(O118-R118>=0,ROUND(O118-R118,0),0)","v":9740},11590,"Geländewagen / SUV","PKW","2024-02-14",{"$f":"IF(O118>=40000,5000,6000)","v":6000},{"$f":"IF(T118-Y118>0,T118-Y118,0)","v":3740},{"$f":"IF(U118-Y118>0,U118-Y118,0)","v":5590}]
[{"$nulls":13},"Hyundai IONIQ Elektro 38,3 kWh",{"$f":"ROUND(34458.82/1.16,2)","v":29705.88},35350,"Hyundai i30 5T 1.5 T­GDI, 6­Gang, 117 kW",{"$f":"ROUND(25139.83/1.16,2)","v":21672.27},25790,8034,9560,"Kompaktklasse","PKW","2020-12-22",6000,2034,3560]
[{"$nulls":13},"Hyundai Kona Elektro 39,2 kWh",{"$f":"ROUND(36250/1.19,2)","v":30462.18},{"$f":"ROUNDUP(O120*1.19,2)","v":36250},"Hyundai Kona 1.6 GDI, Select",{"$f":"ROUND(26900/1.19,2)","v":22605.040000000001},26900,7857,9350,"Geländewagen / SUV","PKW","2020-12-22",6000,1857,3350]
[{"$nulls":13},"Hyundai Kona Elektro 64,0 kWh",{"$f":"ROUND(41850/1.19,2)","v":35168.07},{"$f":"ROUND(O121*1.19,2)","v":41850},"Hyundai Kona 1.6 GDI, Select",{"$f":"ROUND(26900/1.19,2)","v":22605.040000000001},26900,{"$f":"ROUND(O121-R121,0)","v":12563},{"$f":"ROUND(P121-S121,0)","v":14950},"Geländewagen / SUV","PKW","2020-12-22",6000,6563,8950]
[{"$nulls":13},"Hyundai IONIQ 5 Elektro 58 kWh",{"$f":"ROUND(41900/1.19,2)","v":35210.080000000002},{"$f":"ROUND(O122*1.19,2)","v":41900},"Hyundai Tucson 48 V 1.6 T-GDI, 110 kW",{"$f":"ROUND(30500/1.19,2)","v":25630.25},{"$f":"ROUND(R122*1.19,2)","v":30500},9580,11400,"Geländewagen / SUV","PKW","2020-12-22",{"$f":"IF(O122>=40000,5000,6000)","v":6000},3580,5400]
[{"$nulls":13},"Hyundai IONIQ 5 Elektro 72,6 kWh",{"$f":"ROUND((41900+3200)/1.19,2)","v":37899.160000000003},{"$f":"ROUND(O123*1.19,2)","v":45100},"Hyundai Tucson 48 V 1.6 T-GDI, 110 kW",{"$f":"ROUND(30500/1.19,2)","v":25630.25},{"$f":"ROUND(R123*1.19,2)","v":30500},12269,14600,"Geländewagen / SUV","PKW","2020-12-22",6000,6269,8600]
[{"$nulls":13},"Jaguar I-Pace EV400",{"$f":"ROUND(75351.26/1.16,2)","v":64957.98},{"$f":"ROUND(O124*1.19,2)","v":77300},"Jaguar F-Pace D300 AWD",{"$f":"ROUND(64070/1.16,2)","v":55232.76},65726.98,{"$f":"ROUND(O124-R124,0)","v":9725},11573,"Geländewagen / SUV","PKW","2020-12-18",5000,4725,6573,"Smart Fourfour Benzin nicht mehr erhältlich, daher Vergleich mit altem Smart"]
[{"$nulls":13},"Jeep Avenger Elektro",{"$f":"ROUND(P125/1.19,2)","v":31092.44},37000,"VW Taigo Life 70kW",{"$f":"ROUND(S125/1.19,2)","v":20844.54},24805,{"$f":"IF(O125-R125>=0,ROUND(O125-R125,0),0)","v":10248},12195,"Kompaktklasse","PKW","2023-09-06",6000,{"$f":"IF(T125-Y125>0,T125-Y125,0)","v":4248},{"$f":"IF(U125-Y125>0,U125-Y125,0)","v":6195}]
[{"$nulls":13},"Kia e-Soul 39,2 kWh",28563.03,{"$f":"ROUNDDOWN(O126*1.19,2)","v":33990},"Kia Niro 1.6 GDI Hybrid",{"$f":"ROUND(26990/1.19,2)","v":22680.67},26990,5882,7000,"Mini-Van","PKW","2020-12-22",6000,0,1000,"Smart Fourfour Benzin nicht mehr erhältlich, daher Vergleich mit Twingo, Baugleich"]
[{"$nulls":13},"Kia e-Soul 64,0 kWh",31756.3,{"$f":"ROUND(O127*1.19,2)","v":37790},"Kia Niro 1.6 GDI Hybrid",22680.67,26990,9076,10800,"Mini-Van","PKW","2020-12-22",6000,3076,4800]
[{"$nulls":13},"Kia e-Niro 39,2 kWh",29655.46,{"$f":"ROUND(O128*1.19,2)","v":35290},"Kia Niro 1.6 GDI Hybrid",{"$f":"ROUND(26990/1.19,2)","v":22680.67},26990,6975,8300,"Geländewagen / SUV","PKW","2020-12-22",6000,975,2300]
[{"$nulls":13},"Kia e-Niro 64,0 kWh",32848.74,{"$f":"ROUND(O129*1.19,2)","v":39090},"Kia Niro 1.6 GDI Hybrid",{"$f":"ROUND(26990/1.19,2)","v":22680.67},26990,10168,12100,"Geländewagen / SUV","PKW","2020-12-22",6000,4168,6100]
[{"$nulls":13},"Kia Niro EV 64,8 kWh",{"$f":"ROUND(P130/1.19,2)","v":39991.599999999999},47590,"Kia Niro 1.6 GDI Hybrid Vision",{"$f":"ROUND(S130/1.19,2)","v":28563.03},33990,11429,{"$f":"ROUND(P130-S130,0)","v":13600},"Geländewagen / SUV","PKW","2022-09-20",6000,{"$f":"IF(T130-Y130>0,T130-Y130,0)","v":5429},{"$f":"IF(U130-Y130>0,U130-Y130,0)","v":7600}]
[{"$nulls":12},"ffA angepasst nach alter EfA (JR)","Kia EV6 (alle Versionen)",37806.720000000001,44990,"Kia Sportage Edition 7 1,6 T GDI",23352.94,27790,14454,{"$f":"ROUND(P131-S131,0)","v":17200},"Geländewagen / SUV","PKW","2022-09-21",{"$f":"IF(O131>=40000,5000,6000)","v":6000},{"$f":"IF(T131-Y131>0,T131-Y131,0)","v":8454},{"$f":"IF(U131-Y131>0,U131-Y131,0)","v":11200}]
[{"$nulls":13},"Kia EV9 (alle Versionen)",{"$f":"ROUND(P132/1.19,2)","v":60915.97},72490,"Kia Sorento ",{"$f":"ROUND(S132/1.19,2)","v":48899.16},58190,{"$f":"IF(O132-R132>=0,ROUND(O132-R132,0),0)","v":12017},14300,"Geländewagen / SUV","PKW","2024-02-23"]
[{"$nulls":13},"Lexus UX 300e (alle Versionen)",37344.54,44440,"Lexus UX 250h",35420.17,42150,1924,2290,"Geländewagen / SUV","PKW","2023-09-06",6000,0,0]
[{"$nulls":13},"Maserati GranTurismo Folgore","nicht förderfähig gemäß Aufruf","nicht förderfähig gemäß Aufruf",null,0,null,null,null,"Oberklasse","PKW","2024-03-13"]
[{"$nulls":13},"Maserati Grecale Folgore","nicht förderfähig gemäß Aufruf","nicht förderfähig gemäß Aufruf",null,0,null,null,null,"Geländewagen / SUV","PKW","2024-03-13"]
[{"$nulls":13},"Mazda MX-30 e-SKYACTIV",28142.86,{"$f":"ROUND(O136*1.19,2)","v":33490},"CX-30 SKYACTIV-G 2.0 M Hybrid",{"$f":"ROUND(24790/1.19,2)","v":20831.93},24790,{"$f":"ROUND(O136-R136,0)","v":7311},{"$f":"ROUND(P136-S136,0)","v":8700},"Geländewagen / SUV","PKW","2020-12-17",6000,1311,2700]
[{"$nulls":13},"Mercedes Benz smart EQ fortwo (alle Versionen)",18436.97,{"$f":"ROUNDUP(O137*1.19,2)","v":21940},"Mercedes Benz smart 52 kW",{"$f":"ROUND(S137/1.19,2)","v":9382.35},11165,{"$f":"ROUND(O137-R137,0)","v":9055},10775,"Mini","PKW","2020-12-22",6000,3055,4775]
[{"$nulls":13},"Mercedes Benz smart EQ forfour (alle Versionen)",22030.25,22600,"Renault Twingo SCe 75 Intens",{"$f":"ROUND(13637.31/1.16,2)","v":11756.3},{"$f":"ROUND(R138*1.19,2)","v":13990},10274,8610,"Kompaktklasse","PKW","2020-12-22",6000,4274,2610]
[{"$nulls":13},"Mercedes Benz EQA 250",39950,{"$f":"ROUND(O139*1.19,2)","v":47540.5},"Mercedes Benz GLA 180",30920,{"$f":"ROUND(R139*1.19,2)","v":36794.800000000003},{"$f":"ROUND(O139-R139,0)","v":9030},10746,"Geländewagen / SUV","PKW","2021-06-15",6000,3030,4746,"Vergleich mit qashqai ev. Problematisch"]
[{"$nulls":13},"Mercedes Benz EQB (alle Versionen)",{"$f":"ROUND(P140/1.19,2)","v":43985},52342.15,"MB GLB SUV Q95",{"$f":"ROUND(S140/1.19,2)","v":34415},40953.85,9570,11388,"Geländewagen / SUV","PKW","2023-09-06",{"$f":"IF(O140>=40000,5000,6000)","v":5000},{"$f":"IF(T140-Y140>0,T140-Y140,0)","v":4570},{"$f":"IF(U140-Y140>0,U140-Y140,0)","v":6388},"02.03.2023, aus EMI4"]
[{"$nulls":13},"Mercedes Benz EQC 400",59900,{"$f":"ROUND(O141*1.19,2)","v":71281},"Mercedes Benz GLC 300 4MATIC",45880,{"$f":"ROUND(R141*1.19,2)","v":54597.2},14020,16684,"Geländewagen / SUV","PKW","2020-12-17",{"$f":"IF(O141>=40000,5000,6000)","v":5000},9020,11684,"Vergleich mit qashqai ev. Problematisch, stärkerer Motor und stärkere Batterie"]
[{"$nulls":13},"Mercedes Benz EQE (alle Versionen)",{"$f":"ROUND(P142/1.19,2)","v":55800},66402,"Mercedes Benz E220 d",{"$f":"ROUND(S142/1.19,2)","v":45230},53823.7,{"$f":"IF(O142-R142>=0,ROUND(O142-R142,0),0)","v":10570},12578,"Mittelklasse","PKW","2023-09-06",5000,{"$f":"IF(T142-Y142>0,T142-Y142,0)","v":5570},{"$f":"IF(U142-Y142>0,U142-Y142,0)","v":7578}]
[{"$nulls":13},"Mercedes Benz EQE SUV","nicht förderfähig gemäß Aufruf","nicht förderfähig gemäß Aufruf",null,{"$f":"ROUND(S143/1.19,2)","v":0},null,null,null,"Geländewagen / SUV","PKW"]
[{"$nulls":13},"Mercedes Benz EQS","nicht förderfähig gemäß Aufruf","nicht förderfähig gemäß Aufruf",null,0,null,null,null,"Oberklasse","PKW"]
[{"$nulls":13},"Mercedes Benz EQS SUV","nicht förderfähig gemäß Aufruf","nicht förderfähig gemäß Aufruf",null,0,null,null,null,"Geländewagen / SUV","PKW"]
[{"$nulls":13},"Mercedes Benz EQV 250 60kWh (alle Versionen) ",{"$f":"ROUND(P146/1.19,2)","v":59550},70864.5,"Mercedes Benz V250 d, Lang",{"$f":"ROUND(S146/1.19,2)","v":52190},62106.1,7360,8758,"Großraum-Van","PKW","2023-09-06",5000,2360,3758]
[{"$nulls":13},"Mercedes Benz EQV 300 (alle Versionen)",59990,{"$f":"ROUND(O147*1.19,2)","v":71388.100000000006},"Mercedes Benz V220D Lang",44720,{"$f":"ROUND(R147*1.19,2)","v":53216.800000000003},15270,18171,"Großraum-Van","PKW","2020-12-17",5000,10270,13171,"letzte Liste vom NV200 nehmen, Wechsel auf NV250?"]
[{"$nulls":13},"Mercedes-Benz eCitan (nur M1-Versionen)",{"$f":"ROUND(P148/1.19,2)","v":36220},{"$f":"ROUND(36220*1.19,2)","v":43101.8},"Mercedes Benz Citan 75 kW",{"$f":"ROUND(S148/1.19,2)","v":21590},{"$f":"ROUND(21590*1.19,2)","v":25692.1},{"$f":"IF(O148-R148>=0,ROUND(O148-R148,0),0)","v":14630},17410,"Großraum-Van","PKW","2023-09-06",6000,{"$f":"IF(T148-Y148>0,T148-Y148,0)","v":8630},{"$f":"IF(U148-Y148>0,U148-Y148,0)","v":11410}]
[{"$nulls":13},"Mercedes-Benz EQT (nur M1-Versionen)",41550,49444.5,"Mercedes Benz T 160, 75 kW",27510,32736.9,14040,16708,"Großraum-Van","PKW","2023-09-06",5000,9040,11708]
[{"$nulls":13},"Mercedes Benz eVito Tourer 90 kWh (nur M1-Versionen)",53990,{"$f":"ROUND(O150*1.19,2)","v":64248.1},"MB Vito Tourer, Base, Lang",{"$f":"ROUND(34846.4/1.16,2)","v":30040},{"$f":"ROUND(R150*1.19,2)","v":35747.599999999999},23950,28501,"Großraum-Van","PKW","2020-12-17",5000,18950,23501,"Ampera-E, nur Lagerfahrzeuge"]
[{"$nulls":12}," ","MG MG4 51 kWh (alle Versionen)",{"$f":"ROUND(P151/1.19,2)","v":26882.35},31990,"Kia Ceed Vision 1.0 T-GDI 74 kW",{"$f":"ROUND(S151/1.19,2)","v":20747.900000000001},24690,{"$f":"IF(O151-R151>=0,ROUND(O151-R151,0),0)","v":6134},7300,"Kompaktklasse","PKW","2023-09-06",6000,{"$f":"IF(T151-Y151>0,T151-Y151,0)","v":134},{"$f":"IF(U151-Y151>0,U151-Y151,0)","v":1300}]
[{"$nulls":13},"MG MG4 64 kWh (alle Versionen)",30243.7,35990,"Kia Ceed Vision 1.0 T-GDI 74 kW",20747.900000000001,24690,9496,11300,"Kompaktklasse","PKW","2023-09-06",6000,3496,5300]
[{"$nulls":13},"MG MG5 50 kWh (alle Versionen)",29823.53,{"$f":"32812.5+2677.5","v":35490},"Kia Ceed Sportwagen 1.0 T-GDI",21588.240000000002,25690,8235,9800,"Mittelklasse","PKW","2023-09-06",6000,2235,3800]
[{"$nulls":13},"MG MG5 61 kWh (alle Versionen)",32344.54,{"$f":"35812.5+2677.5","v":38490},"Kia Ceed Sportwagen 1.0 T-GDI",21588.240000000002,25690,10756,12800,"Mittelklasse","PKW","2023-09-06",6000,4756,6800]
[{"$nulls":13},"MG Marvel-R (alle Versionen)",{"$f":"ROUND(P155/1.19,2)","v":39487.39},46990,"VW Tiguan Life 1.5 TSI OPF  6 Gang 110 kW",{"$f":"ROUND(S155/1.19,2)","v":31121.85},37035,8366,9955,"Geländewagen / SUV","PKW","2023-09-06",6000,2366,3955]
[{"$nulls":13},"MG ZS EV (alle Versionen)",{"$f":"(31990)/1.19","v":26882.352941176472},{"$f":"ROUND(O156*1.19,2)","v":31990},"Peugeot 2008 PureTech 130 Active",{"$f":"ROUND(S156/1.19,2)","v":19537.82},23250,7345,8740,"Kompaktklasse","PKW","2021-06-22",{"$f":"IF(O156>=40000,5000,6000)","v":6000},1345,2740]
[{"$nulls":12},"zuordnung Fzg-kl. Am 21.02.2024 geändert","MINI COOPER SE 3-Türer (alle Versionen)",{"$f":"ROUND(P157/1.19,2)","v":31680.67},37700,"Mini Cooper S 3-Türer",{"$f":"ROUND(S157/1.19,2)","v":26974.79},32100,{"$f":"IF(O157-R157>=0,ROUND(O157-R157,0),0)","v":4706},5600,"Mini","PKW","2020-12-17",6000,0,0,"Preis aktuell / Preisliste vorhanden"]
[{"$nulls":12},"zuordnung Fzg-kl. Am 21.02.2024 geändert","MINI COOPER E 36,6 kWh MY 24 (alle Versionen)",27647.06,32900,"MINI Cooper C",{"$f":"ROUND(S158/1.19,2)","v":24285.71},28900,3361,4000,"Mini","PKW","2024-02-14",{"$f":"IF(O158>=40000,5000,6000)","v":6000},{"$f":"IF(T158-Y158>0,T158-Y158,0)","v":0},{"$f":"IF(U158-Y158>0,U158-Y158,0)","v":0}]
[{"$nulls":12},"zuordnung Fzg-kl. Am 21.02.2024 geändert","MINI COOPER SE 49.2 kWh MY 24(alle Versionen)",31008.400000000001,36900,"MINI Cooper C",{"$f":"ROUND(S159/1.19,2)","v":24285.71},28900,6723,8000,"Mini","PKW","2024-02-14",6000,723,2000]
[{"$nulls":13},"MINI Countryman E 64,6 kWh, U25 (alle Versionen)",{"$f":"ROUND(P160/1.19,2)","v":36554.620000000003},43500,"MINI Countryman C",{"$f":"ROUND(S160/1.19,2)","v":33529.410000000003},39900,{"$f":"IF(O160-R160>=0,ROUND(O160-R160,0),0)","v":3025},3600,"Geländewagen / SUV","PKW","2024-02-14",6000,0,0]
[{"$nulls":13},"Nio ET5 75 kWh (alle Versionen)",{"$f":"ROUND(P161/1.19,2)","v":50000},59500,"BMW 330i xDrive",{"$f":"ROUND(S161/1.19,2)","v":48991.6},58300,{"$f":"IF(O161-R161>=0,ROUND(O161-R161,0),0)","v":1008},1200,"Mittelklasse","PKW","2023-09-06",5000,0,0]
[{"$nulls":13},"Nio ET5 100 kWh (alle Versionen)",57563.03,68500,"BMW 330i xDrive",48991.6,58300,8571,10200,"Mittelklasse","PKW","2023-09-06",5000,3571,5200]
[{"$nulls":13},"Nissan ARIYA 63 kWh (alle Versionen)",39907.56,47490,"Nissan X-Trail",33109.24,39400,6798,8090,"Geländewagen / SUV","PKW","2023-09-06",6000,798,2090]
[{"$nulls":13},"Nissan ARIYA 87 kWh (alle Versionen)",53352.94,63490,"Nissan X-Trail",37310.92,44400,16042,19090,"Geländewagen / SUV","PKW","2023-09-06",5000,11042,14090]
[{"$nulls":13},"Nissan Leaf ZE1 110 kW (40 kwh)",{"$f":"32363.03/1.16","v":27899.163793103449},{"$f":"ROUND(O165*1.19,2)","v":33200},"Nissan Qashqai 1.3 DIG-T 103 kW",{"$f":"ROUND(25495.63/1.16,2)","v":21978.99},{"$f":"ROUND(R165*1.19,2)","v":26155},{"$f":"ROUND(O165-R165,0)","v":5920},7045,"Kompaktklasse","PKW","2020-12-22",6000,0,1045]
[{"$nulls":13},"Nissan Leaf ZE1 160 kW (62 kwh)",{"$f":"37383.19/1.16","v":32226.887931034486},{"$f":"ROUND(O166*1.19,2)","v":38350},"Nissan Qashqai 1.3 DIG-T 117 kW",{"$f":"ROUND(29705/1.19,2)","v":24962.18},{"$f":"ROUNDUP(R166*1.19,2)","v":29705},7265,8645,"Kompaktklasse","PKW","2020-12-22",6000,1265,2645,"PKW-Zulassung???"]
[{"$nulls":13},"Nissan e-NV200 (nur M1-Versionen)",36498,{"$f":"ROUND(O167*1.19,2)","v":43432.62},"Nissan NV200 Evalia 5-Sitzer",{"$f":"ROUND(S167/1.19,2)","v":19823.53},23590,{"$f":"ROUND(O167-R167,0)","v":16674},19843,"Großraum-Van","PKW","2020-12-22",6000,10674,13843]
[{"$nulls":13},"Nissan Townstar EV (nur M1-Versionen)",{"$f":"ROUND(P168/1.19,2)","v":28660},34105.4,"Nissan Townstar (nur M1-Versionen)",20210,24049.9,{"$f":"IF(O168-R168>=0,ROUND(O168-R168,0),0)","v":8450},10056,"Großraum-Van","PKW","2023-09-06",6000,2450,4056]
[{"$nulls":12},"L6e (45 km/h)","Ökoflitzer Paxster 2.2 L6e (alle Versionen)",16900,{"$f":"ROUND(16900*1.19,2)","v":20111},"Aixam D-Truck Pritsche",13100.84,15590,3799,4521,"Leichtfahrzeug","LFZ","2023-09-06"]
[{"$nulls":12},"L7e (60 km/h)","Ökoflitzer Paxster 2.2 L7e (alle Versionen)",17329,{"$f":"ROUNDDOWN((16900+429)*1.19,2)","v":20621.509999999998},"Aixam D-Truck Pritsche",13100.84,15590,4228,5032,"Leichtfahrzeug","LFZ","2023-09-06"]
[{"$nulls":13},"Opel Ampera-E Plus",{"$f":"ROUND(41906.22/1.16,2)","v":36126.050000000003},{"$f":"O171*1.19","v":42989.999499999998},"Opel Astra 1.4 Direct Injection Turbo 107 kW",{"$f":"ROUND(27025/1.19,2)","v":22710.080000000002},{"$f":"ROUND(R171*1.19,2)","v":27025},{"$f":"ROUND(O171-R171,0)","v":13416},15965,"Kompaktklasse","PKW","2020-12-22",6000,7416,9965]
[{"$nulls":13},"Opel Astra Electric (alle Versionen)",{"$f":"ROUND(P172/1.19,2)","v":37865.550000000003},45060,"Opel Astra (96 kW)",{"$f":"ROUND(S172/1.19,2)","v":26663.87},31730,{"$f":"IF(O172-R172>=0,ROUND(O172-R172,0),0)","v":11202},13330,"Kompaktklasse","PKW","2023-09-06",6000,5202,7330]
[{"$nulls":13},"Opel Combo-e Life (alle Versionen)",{"$f":"ROUND(38100/1.19,2)","v":32016.81},{"$f":"O173*1.19","v":38100.003900000003},"Opel Combo Life Edition 81 kW",{"$f":"ROUND(25180/1.19,2)","v":21159.66},{"$f":"R173*1.19","v":25179.9954},{"$f":"ROUND(O173-R173,0)","v":10857},{"$f":"ROUND(P173-S173,0)","v":12920},"Großraum-Van","PKW","2021-06-23",{"$f":"IF(O173>=40000,5000,6000)","v":6000},4857,6920]
[{"$nulls":13},"Opel Corsa-e",{"$f":"ROUND(30650/1.19,2)","v":25756.3},{"$f":"O174*1.19","v":30649.996999999999},"Opel Corsa Edition (74 kW)",{"$f":"ROUND(18250/1.19,2)","v":15336.13},{"$f":"ROUNDUP(R174*1.19,2)","v":18250},10420,12400,"Kleinwagen","PKW","2020-12-22",6000,4420,6400]
[{"$nulls":12},"zuordnung Fzg-kl. Am 21.02.2024 geändert","Opel Mokka-E (alle Versionen)",{"$f":"ROUND(P175/1.19,2)","v":34159.660000000003},40650,"Opel Mokka 1.2 Elegance 74 kW",{"$f":"ROUND(S175/1.19,2)","v":22168.07},26380,{"$f":"IF(O175-R175>=0,ROUND(O175-R175,0),0)","v":11992},14270,"Geländewagen / SUV","PKW","2020-12-18",6000,5992,8270]
[{"$nulls":13},"Opel Rocks-e (alle Versionen)",{"$f":"ROUND(P176/1.19,2)","v":6714.29},7990,"Kymco Maxxer S300 T ONROAD LOF (Quad)",{"$f":"ROUND(S176/1.19,2)","v":4957.1400000000003},5899,{"$f":"IF(O176-R176>=0,ROUND(O176-R176,0),0)","v":1757},2091,"Leichtfahrzeug","LFZ","2023-09-06"]
[{"$nulls":13},"Opel Zafira-E Life 50 kWh (nur M1-Versionen)",{"$f":"ROUND(55904.2/1.16,2)","v":48193.279999999999},{"$f":"O177*1.19","v":57350.003199999999},"Opel Zafira Life M 88 kW",{"$f":"ROUND(43602.35/1.16,2)","v":37588.230000000003},{"$f":"ROUNDUP(R177*1.19,2)","v":44730},10605,12620,"Großraum-Van","PKW","2020-12-18",5000,5605,7620]
[{"$nulls":13},"Opel Zafira-E Life 75 kWh (nur M1-Versionen)",{"$f":"ROUND(61752.94/1.16,2)","v":53235.29},63349.9951,"Opel Zafira Life M 88 kW",{"$f":"ROUND(43602.35/1.16,2)","v":37588.230000000003},{"$f":"ROUNDUP(R178*1.19,2)","v":44730},15647,18620,"Großraum-Van","PKW","2020-12-18",5000,10647,13620]
[{"$nulls":13},"Opel Vivaro-E Kombi 50 kWh (nur M1-Versionen)",42250,50277.5,"Opel Kombi 90 kW",34410,{"$f":"R179*1.19","v":40947.9},{"$f":"ROUND(O179-R179,0)","v":7840},9330,"Großraum-Van","PKW","2020-12-22",5000,2840,4330]
[{"$nulls":13},"Opel Vivaro-E Kombi 75 kWh (nur M1-Versionen)",47250,56227.5,"Opel Kombi 90 kW",34410,40947.9,{"$f":"ROUND(O180-R180,0)","v":12840},15280,"Großraum-Van","PKW","2020-12-22",5000,7840,10280,"T60 AWD ist nicht mehr lieferbar, Vergleich mit S 60 B5 184 kW, EUR Netto 39621,85???"]
[{"$nulls":13},"Peugeot e-208 (alle Versionen)",{"$f":"ROUND(30852.1/1.16,2)","v":26596.639999999999},{"$f":"ROUND(O181*1.19,2)","v":31650},"Peugeot 208 PureTech 100 Active Pack",{"$f":"ROUND(18862.18/1.16,2)","v":16260.5},{"$f":"ROUNDUP(R181*1.19,2)","v":19350},{"$f":"ROUND(O181-R181,0)","v":10336},{"$f":"ROUND(P181-S181,0)","v":12300},"Kleinwagen","PKW","2020-12-22",6000,4336,6300]
[{"$nulls":13},"Peugeot e-2008 (alle Versionen)",{"$f":"ROUND(34556.3/1.16,2)","v":29789.91},{"$f":"ROUNDUP(O182*1.19,2)","v":35450},"Peugeot 2008 PureTech 130 Active",{"$f":"ROUND(23346.22/1.16,2)","v":20126.05},{"$f":"ROUNDUP(R182*1.19,2)","v":23950},9664,11500,"Geländewagen / SUV","PKW","2020-12-22",6000,3664,5500,"Neuer Clio ist nur als 3-Türer erhältlich"]
[{"$nulls":13},"Peugeot e-308 (alle Versionen)",{"$f":"ROUND(P183/1.19,2)","v":37617.65},44765,"Peugeot 308 PureTech 130",{"$f":"ROUND(S183/1.19,2)","v":26260.5},31250,{"$f":"IF(O183-R183>=0,ROUND(O183-R183,0),0)","v":11357},13515,"Kompaktklasse","PKW","2023-09-29",{"$f":"IF(O183>=40000,5000,6000)","v":6000},{"$f":"IF(T183-Y183>0,T183-Y183,0)","v":5357},{"$f":"IF(U183-Y183>0,U183-Y183,0)","v":7515}]
[{"$nulls":13},"Peugeot E-3008 (alle Versionen) 73 kWh",40882.35,48650,"Peugeot 3008 ",32983.19,39250,7899,9400,"Geländewagen / SUV","PKW","2024-03-26",{"$f":"IF(O184>=40000,5000,6000)","v":5000},{"$f":"IF(T184-Y184>0,T184-Y184,0)","v":2899},{"$f":"IF(U184-Y184>0,U184-Y184,0)","v":4400}]
[{"$nulls":13},"Peugeot E-Expert Kombi 50kWh (nur M1-Versionen)",{"$f":"ROUND(48388.57/1.16,2)","v":41714.28},{"$f":"ROUNDUP(O185*1.19,2)","v":49640},"Peugeot Expert L2 BlueHDi  120 88 kW",{"$f":"ROUND(34205.38/1.16,2)","v":29487.4},{"$f":"ROUNDDOWN(R185*1.19,2)","v":35090},{"$f":"ROUND(O185-R185,0)","v":12227},{"$f":"ROUND(P185-S185,0)","v":14550},"Großraum-Van","PKW","2020-12-22",5000,7227,9550,"Neuer Clio ist nur als 3-Türer erhältlich"]
[{"$nulls":13},"Peugeot E-Expert Kombi 75kWh (nur M1-Versionen)",{"$f":"ROUND(P186/1.19,2)","v":48689.08},57940,"Toyota Proace Verso 106 kW, L1-Version ",{"$f":"ROUND(S186/1.19,2)","v":44302.52},52720,{"$f":"IF(O186-R186>=0,ROUND(O186-R186,0),0)","v":4387},5220,"Großraum-Van","PKW","2023-09-06",5000,0,220]
[{"$nulls":13},"Peugeot E-Traveller 50kWh (nur M1-Versionen)",{"$f":"ROUND(54490.76/1.16,2)","v":46974.79},{"$f":"ROUND(O187*1.19,2)","v":55900},"Peugeot Expert L2 BlueHDi  120 88 kW",{"$f":"ROUND(40307.56/1.16,2)","v":34747.9},{"$f":"ROUNDDOWN(R187*1.19,2)","v":41350},12227,14550,"Großraum-Van","PKW","2020-12-22",5000,7227,9550]
[{"$nulls":13},"Peugeot E-Traveller 75kWh (nur M1-Versionen)",{"$f":"ROUND(P188/1.19,2)","v":50117.65},59640,"Toyota Proace Verso 106 kW, L1-Version ",{"$f":"ROUND(S188/1.19,2)","v":44302.52},52720,{"$f":"IF(O188-R188>=0,ROUND(O188-R188,0),0)","v":5815},6920,"Großraum-Van","PKW","2023-09-06",5000,815,1920]
[{"$nulls":13},"Peugeot e-Rifter (alle Versionen)",{"$f":"ROUND(37590/1.19,2)","v":31588.240000000002},{"$f":"ROUNDDOWN(O189*1.19,2)","v":37590},"Peugeot e-Rifter PureTech 110 81 kW",{"$f":"ROUND(25140/1.19,2)","v":21126.05},{"$f":"R189*1.19","v":25139.999499999998},10462,12450,"Großraum-Van","PKW","2021-06-22",{"$f":"IF(O189>=40000,5000,6000)","v":6000},4462,6450]
[{"$nulls":13},"Polestar 2",48655.46,{"$f":"ROUNDUP(O190*1.19,2)","v":57900},"Volvo S60 T6 AWD",{"$f":"ROUND(S190/1.19,2)","v":43865.55},52200,4790,5700,"Mittelklasse","PKW","2020-12-22",5000,0,700]
[{"$nulls":13},"Porsche Taycan (alle Versionen)","nicht förderfähig gemäß Aufruf","nicht förderfähig gemäß Aufruf",null,0,null,null,null,"Oberklasse","PKW","2020-12-18",0,0,0]
[{"$nulls":13},"Renaut Kangoo E-TECH (alle Versionen)",{"$f":"ROUND(P192/1.19,2)","v":33025.21},39300,"Renaut Kangoo TCe 74 kW",21806.720000000001,25950,{"$f":"IF(O192-R192>=0,ROUND(O192-R192,0),0)","v":11218},13350,"Großraum-Van","PKW","2023-09-06",6000,{"$f":"IF(T192-Y192>0,T192-Y192,0)","v":5218},{"$f":"IF(U192-Y192>0,U192-Y192,0)","v":7350}]
[{"$nulls":13},"Renault Megane E-TECH EV40 40kWh (alle Versionen)",35294.120000000003,42000,"Renault Megane TCe 140 103 kW",23949.58,28500,11345,13500,"Kompaktklasse","PKW","2024-01-11",{"$f":"IF(O193>=40000,5000,6000)","v":6000},{"$f":"IF(T193-Y193>0,T193-Y193,0)","v":5345},{"$f":"IF(U193-Y193>0,U193-Y193,0)","v":7500}]
[{"$nulls":13},"Renault Megane E-TECH EV60 60kWh (alle Versionen)",39159.660000000003,46600,"Renault Megane TCe 140 103 kW",23949.58,28500,15210,18100,"Kompaktklasse","PKW","2024-01-11",6000,9210,12100]
[{"$nulls":12},"zuordnung Fzg-kl. Am 21.02.2024 geändert","Renault Scenic E-Tech 170 Comfort Range (alle Versionen)",34789.919999999998,41400,"Renault Austral Mild Hybrid 116 kW",28529.41,33950,6261,7450,"Geländewagen / SUV","PKW","2024-01-11",6000,261,1450]
[{"$nulls":12},"zuordnung Fzg-kl. Am 21.02.2024 geändert","Renault Scenic E-Tech 220 Long Range (alle Versionen)",41092.44,48900,"Renault Austral Mild Hybrid 116 kW",28529.41,33950,12563,14950,"Geländewagen / SUV","PKW","2024-01-11",5000,7563,9950]
[{"$nulls":13},"Renault Zoe Z.E.40 (alle Versionen)",{"$f":"ROUND(29233.95/1.16,2)","v":25201.68},{"$f":"ROUNDUP(O197*1.19,2)","v":29990},"Renault Clio Zen  Sce 75/5-türig",{"$f":"ROUND(16350/1.19,2)","v":13739.5},{"$f":"ROUNDDOWN(R197*1.19,2)","v":16350},{"$f":"ROUND(O197-R197,0)","v":11462},{"$f":"ROUND(P197-S197,0)","v":13640},"Kleinwagen","PKW","2020-12-22",6000,{"$f":"IF(T197-Y197>0,T197-Y197,0)","v":5462},{"$f":"IF(U197-Y197>0,U197-Y197,0)","v":7640}]
[{"$nulls":13},"Renault Zoe Z.E.50 (alle Versionen)",{"$f":"ROUND(31183.53/1.16,2)","v":26882.35},31990,"Renault Clio Zen  Sce 75/5-türig",{"$f":"ROUND(16350/1.19,2)","v":13739.5},{"$f":"ROUNDDOWN(R198*1.19,2)","v":16350},{"$f":"ROUND(O198-R198,0)","v":13143},{"$f":"ROUND(P198-S198,0)","v":15640},"Kleinwagen","PKW","2020-12-22",6000,7143,9640]
[{"$nulls":12},"zuordnung Fzg-kl. Am 21.02.2024 geändert","Renault Twingo Electric (alle Versionen)",{"$f":"ROUND(P199/1.19,2)","v":23529.41},28000,"Renault Twingo SCe 65",{"$f":"ROUND(S199/1.19,2)","v":13529.41},16100,{"$f":"IF(O199-R199>=0,ROUND(O199-R199,0),0)","v":10000},11900,"Mini","PKW","2020-12-18",6000,4000,5900]
[{"$nulls":13},"Renault Twizy ( alle Versionen)",{"$f":"ROUND(12150/1.19,2)","v":10210.08},{"$f":"ROUND(O200*1.19,2)","v":12150},"Kymco Maxxer S300 T ONROAD LOF (Quad)",{"$f":"ROUND(S200/1.19,2)","v":4242.8599999999997},5049,{"$f":"ROUND(O200-R200,0)","v":5967},7101,"Leichtfahrzeug","LFZ","2020-12-22"]
[{"$nulls":13},"Renault Twizy 45 (alle Versionen)",{"$f":"ROUND(11450/1.19,2)","v":9621.85},{"$f":"ROUND(O201*1.19,2)","v":11450},"Kymco Maxxer S300 T ONROAD LOF (Quad)",4242.8599999999997,5049,5379,6401,"Leichtfahrzeug","LFZ","2020-12-22"]
[{"$nulls":13},"RollsRoyce Spectre","nicht förderfähig gemäß Aufruf",{"$nulls":6},"Oberklasse","PKW","2024-03-13"]
[{"$nulls":13},"Silence SO4 11,2 kWh (alle Versionen)",{"$f":"ROUND(P203/1.19,2)","v":13145.38},15643,"Aixam City Pack",10075.629999999999,11990,{"$f":"IF(O203-R203>=0,ROUND(O203-R203,0),0)","v":3070},3653,"Leichtfahrzeug","LFZ","2023-09-06"]
[{"$nulls":13},"Skoda ENYAQ iV 50 (alle Versionen)",{"$f":"ROUND(33800/1.19,2)","v":28403.360000000001},{"$f":"ROUND(O204*1.19,2)","v":33800},"Skoda Kodiaq 1,5 l TSI ACT1 110 kW, 6 Gang",{"$f":"ROUND(29000/1.19,2)","v":24369.75},{"$f":"ROUND(R204*1.19,2)","v":29000},4034,4800,"Geländewagen / SUV","PKW","2020-12-18",6000,0,0]
[{"$nulls":13},"Skoda ENYAQ iV 60 (alle Versionen)",{"$f":"ROUND(38850/1.19,2)","v":32647.06},{"$f":"ROUND(O205*1.19,2)","v":38850},"Skoda Kodiaq 1,5 l TSI ACT1 110 kW, 6 Gang",{"$f":"ROUND(29000/1.19,2)","v":24369.75},29000,8277,9850,"Geländewagen / SUV","PKW","2020-12-18",6000,2277,3850]
[{"$nulls":13},"Skoda ENYAQ iV 80 (alle Versionen)",{"$f":"ROUND(43950/1.19,2)","v":36932.769999999997},43950,"Skoda Kodiaq 1,5 l TSI ACT1 110 kW, 6 Gang",{"$f":"ROUND(29000/1.19,2)","v":24369.75},29000,12563,14950,"Geländewagen / SUV","PKW","2020-12-18",6000,6563,8950]
[{"$nulls":13},"Smart #1 49 kWh (alle Versionen)",{"$f":"ROUND(P207/1.19,2)","v":31504.2},37490,"Mercedes Benz GLA 180",{"$f":"ROUND(S207/1.19,2)","v":34425},40965.75,{"$f":"IF(O207-R207>=0,ROUND(O207-R207,0),0)","v":0},0,"Geländewagen / SUV","PKW","2024-02-15",{"$f":"IF(O207>=40000,5000,6000)","v":6000},{"$f":"IF(T207-Y207>0,T207-Y207,0)","v":0},{"$f":"IF(U207-Y207>0,U207-Y207,0)","v":0}]
[{"$nulls":12},"Bezeichnung geändert 19.02.2024","Smart #1 66 kWh (alle Versionen)",{"$f":"ROUND(P208/1.19,2)","v":34865.550000000003},41490,"Mercedes Benz GLA 180",34425,40965.75,441,524,"Geländewagen / SUV","PKW",null,6000,0,0]
[{"$nulls":13},"Smart #3 49 kWh (alle Versionen)",{"$f":"ROUND(P209/1.19,2)","v":32344.54},38490,"Mercedes Benz GLA 180",34425,40965.75,0,0,"Geländewagen / SUV","PKW","2024-02-15",6000,0,0]
[{"$nulls":13},"Smart #3 66 kWh (alle Versionen)",{"$f":"ROUND(P210/1.19,2)","v":36546.22},43490,"Mercedes Benz GLA 180",34425,40965.75,2121,2524,"Geländewagen / SUV","PKW","2024-02-15",6000,0,0]
[{"$nulls":13},"SsangYong Korando e-Motion (alle Versionen)",{"$f":"ROUND(P211/1.19,2)","v":35705.879999999997},42490,"SsangYong Korando Crystal",{"$f":"ROUND(S211/1.19,2)","v":23941.18},28490,{"$f":"IF(O211-R211>=0,ROUND(O211-R211,0),0)","v":11765},14000,"Geländewagen / SUV","PKW","2023-09-06",6000,5765,8000]
[{"$nulls":13},"Subaru Solterra (alle Versionen)",48310.92,57490,"Subaru Outback 2.5i Active",37596.639999999999,44740,10714,12750,"Geländewagen / SUV","PKW","2023-09-06",5000,5714,7750]
[{"$nulls":13},"Tesla Model 3 Standard-Plus",{"$f":"ROUND(39990/1.19+3000,2)","v":36605.040000000001},{"$f":"O213*1.19","v":43559.997600000002},"BMW 320i, 135 kW",{"$f":"ROUND(39820.17/1.16,2)","v":34327.730000000003},{"$f":"R213*1.19","v":40849.998700000004},{"$f":"ROUND(O213-R213,0)","v":2277},2710,"Mittelklasse","PKW","2020-12-18",6000,0,0]
[{"$nulls":13},"Tesla Model 3 Long Range (alle Versionen)",{"$f":"ROUND(49990/1.19+3000,2)","v":45008.4},{"$f":"O214*1.19","v":53559.995999999999},"BMW 330i ",{"$f":"ROUND(44499.16/1.16,2)","v":38361.339999999997},{"$f":"ROUNDUP(R214*1.19,2)","v":45650},6647,{"$f":"ROUND(P214-S214,0)","v":7910},"Mittelklasse","PKW","2020-12-18",5000,1647,2910]
[{"$nulls":13},"Tesla Model S (alle Versionen)","nicht förderfähig gemäß Aufruf","nicht förderfähig gemäß Aufruf",null,{"$f":"ROUND(S215/1.19,2)","v":0},null,null,null,"Oberklasse","PKW","2020-12-18",0,0,0]
[{"$nulls":13},"Tesla Model Y Standard Range (alle Versionen)",{"$f":"ROUND(P216/1.19,2)","v":37722.69},44890,"BMW X3 xDrive20d (keine förderfähigen Investitionsmehrausgaben)",{"$f":"ROUND(S216/1.19,2)","v":49243.7},58600,{"$f":"IF(O216-R216>=0,ROUND(O216-R216,0),0)","v":0},0,"Geländewagen / SUV","PKW","2023-09-06",6000,0,0]
[{"$nulls":13},"Tesla Model Y LongRange (alle Versionen)",{"$f":"ROUND(58620/1.19,2)","v":49260.5},{"$f":"O217*1.19","v":58619.994999999995},"BMW X3 xDrive30i",{"$f":"ROUND(53028.56/1.16,2)","v":45714.28},{"$f":"ROUNDUP(R217*1.19,2)","v":54400},{"$f":"ROUND(O217-R217,0)","v":3546},{"$f":"ROUND(P217-S217,0)","v":4220},"Geländewagen / SUV","PKW","2020-12-18",5000,0,0]
[{"$nulls":13},"Tesla Model X (alle Versionen)","nicht förderfähig gemäß Aufruf","nicht förderfähig gemäß Aufruf",null,{"$f":"ROUND(S218/1.19,2)","v":0},null,null,null,"Geländewagen / SUV","PKW","2020-12-18",0,0,0]
[{"$nulls":13},"Toyota bZ4X (alle Versionen)",{"$f":"ROUND(P219/1.19,2)","v":39907.56},47490,"Toyota RAV4 160 kW",36798.32,43790,{"$f":"IF(O219-R219>=0,ROUND(O219-R219,0),0)","v":3109},3700,"Geländewagen / SUV","PKW","2023-09-06",6000,0,0]
[{"$nulls":13},"Toyota Proace City Verso Electric",31764.71,37800,"Toyota Proace City Verso",22495.8,26770,9269,11030,"Großraum-Van","PKW","2023-04-25",6000,3269,5030]
[{"$nulls":13},"Toyota Proace Verso Electric 50 kWh (alle M1-Versionen)",{"$f":"ROUND(58530/1.19,2)","v":49184.87},{"$f":"ROUND(O221*1.19,2)","v":58530},"Toyota Proace Verso 88 kW",{"$f":"ROUND(43980/1.19,2)","v":36957.980000000003},{"$f":"ROUND(R221*1.19,2)","v":43980},12227,{"$f":"ROUND(P221-S221,0)","v":14550},"Großraum-Van","PKW","2021-06-18",5000,7227,9550]
[{"$nulls":13},"Toyota Proace Verso Electric 75 kWh (alle M1-Versionen)",{"$f":"ROUND(64530/1.19,2)","v":54226.89},{"$f":"ROUND(O222*1.19,2)","v":64530},"Toyota Proace Verso 88 kW",{"$f":"ROUND(43980/1.19,2)","v":36957.980000000003},{"$f":"ROUND(R222*1.19,2)","v":43980},17269,{"$f":"ROUND(P222-S222,0)","v":20550},"Großraum-Van","PKW","2021-06-18",5000,12269,15550]
[{"$nulls":13},"Tropos Motors ABLE XT1 (13kWh) (nur LFZ-Versionen, FIN:…..E...)",23000,{"$f":"O223*1.19","v":27370},"Piaggio Porter - Entry Level Chassis",11071.43,{"$f":"ROUNDUP(R223*1.19,2)","v":13175.01},11929,{"$f":"ROUND(P223-S223,0)","v":14195},"Leichtfahrzeug","LFZ","2021-02-05"]
[{"$nulls":13},"Tropos Motors ABLE XT2 (26kWh) (nur LFZ-Versionen, FIN:…..D...)",27000,{"$f":"O224*1.19","v":32130},"Piaggio Porter - Entry Level Chassis",11071.43,{"$f":"ROUNDUP(R224*1.19,2)","v":13175.01},{"$f":"ROUND(O224-R224,0)","v":15929},{"$f":"ROUND(P224-S224,0)","v":18955},"Leichtfahrzeug","LFZ","2021-02-05"]
[{"$nulls":13},"Volkswagen e-up!",{"$f":"ROUND(P225/1.19,2)","v":25205.88},29995,"VW up!",{"$f":"ROUND(S225/1.19,2)","v":13743.7},16355,{"$f":"IF(O225-R225>=0,ROUND(O225-R225,0),0)","v":11462},13640,"Kleinwagen","PKW","2023-09-06",6000,5462,7640]
[{"$nulls":13},"Volkswagen ID.3  45 kWh (alle Versionen)",{"$f":"ROUND(31495/1.19,2)","v":26466.39},{"$f":"ROUND(O226*1.19,2)","v":31495},"VW Golf 1.5 TSI OPF 6-Gang 96 kW",{"$f":"ROUND(26036.64/1.16,2)","v":22445.38},{"$f":"ROUND(R226*1.19,2)","v":26710},{"$f":"ROUND(O226-R226,0)","v":4021},4785,"Kompaktklasse","PKW","2021-01-21",6000,0,0]
[{"$nulls":13},"Volkswagen ID.3  58 kWh (alle Versionen)",{"$f":"ROUND(34995/1.19,2)","v":29407.56},{"$f":"ROUND(O227*1.19,2)","v":34995},"VW Golf 1.5 TSI OPF 6-Gang 96 kW",{"$f":"ROUND(26036.64/1.16,2)","v":22445.38},{"$f":"ROUND(R227*1.19,2)","v":26710},{"$f":"ROUND(O227-R227,0)","v":6962},{"$f":"ROUND(P227-S227,0)","v":8285},"Kompaktklasse","PKW","2021-01-18",6000,962,2285]
[{"$nulls":13},"Volkswagen ID.3 77 kWh Performance (alle Versionen)",35289.919999999998,{"$f":"ROUND(O228*1.19,2)","v":41995},"VW Golf Life 1.5 TSI OPF 6-Gang 110 kW",23302.52,{"$f":"ROUND(R228*1.19,2)","v":27730},11987,14265,"Kompaktklasse","PKW","2020-12-18",6000,5987,8265]
[{"$nulls":13},"Volkswagen ID.4 Pro 77 kWh Performance (alle Versionen)",{"$f":"ROUND(43329.42/1.16,2)","v":37352.949999999997},{"$f":"ROUNDDOWN(O229*1.19,2)-0.01","v":44450},"VW Tiguan Life 1.5 TSI OPF  Gang 110 kW",{"$f":"ROUND(29901.68/1.16,2)","v":25777.31},{"$f":"ROUND(R229*1.19,2)","v":30675},11576,13775,"Geländewagen / SUV","PKW","2020-12-18",6000,5576,7775]
[{"$nulls":13},"Volkswagen ID.5 (alle Versionen)",{"$f":"ROUND(P230/1.19,2)","v":38936.97},46335,"VW Tiguan Life 1.5 TSI OPF  Gang 110 kW",{"$f":"ROUND(S230/1.19,2)","v":29810.92},35475,9126,10860,"Geländewagen / SUV","PKW","2023-09-06",{"$f":"IF(O230>=40000,5000,6000)","v":6000},{"$f":"IF(T230-Y230>0,T230-Y230,0)","v":3126},{"$f":"IF(U230-Y230>0,U230-Y230,0)","v":4860}]
[{"$nulls":13},"Volkswagen ID.7 77 kWh (alle Versionen)",47894.96,56995,"VW Arteon Shooting Brake",39722.69,47270,{"$f":"IF(O231-R231>=0,ROUND(O231-R231,0),0)","v":8172},9725,"Mittelklasse","PKW","2023-09-06",5000,{"$f":"IF(T231-Y231>0,T231-Y231,0)","v":3172},{"$f":"IF(U231-Y231>0,U231-Y231,0)","v":4725}]
[{"$nulls":13},"Volkswagen ID.Buzz 77 kWh",{"$f":"ROUND(P232/1.19,2)","v":54270},64581.3,"VW Multivan 1.5 TSI OPF",{"$f":"ROUND(S232/1.19,2)","v":37775},44952.25,16495,19629,"Großraum-Van","PKW","2023-09-06",5000,11495,14629]
[{"$nulls":13},"Volkswagen ABT e-Caddy (nur M1-Versionen)",31500,{"$f":"ROUND(O233*1.19,2)","v":37485},"Volkswagen Caddy Kombi 75 kW TDI",22910,{"$f":"ROUND(R233*1.19,2)","v":27262.9},8590,10222,"Großraum-Van","PKW","2021-01-28",{"$f":"IF(O233>=40000,5000,6000)","v":6000},2590,4222]
[{"$nulls":13},"Volkswagen ABT e-T 6.1 (Caravelle, Kombi, nur M1-Versionen)",49623,59051.37,"Volkswagen Transporter 6.1 Kombi 81 kW EcoProfi",31120,37032.800000000003,18503,22019,"Großraum-Van","PKW","2021-01-28",5000,13503,17019]
[{"$nulls":13},"Volvo EX30 51 kWh (alle Versionen)",{"$f":"ROUND(P235/1.19,2)","v":30747.9},36590,"Mercedes Benz GLA 180",{"$f":"ROUND(S235/1.19,2)","v":34425},40965.75,{"$f":"IF(O235-R235>=0,ROUND(O235-R235,0),0)","v":0},0,"Geländewagen / SUV","PKW","2024-02-15",{"$f":"IF(O235>=40000,5000,6000)","v":6000},{"$f":"IF(T235-Y235>0,T235-Y235,0)","v":0},{"$f":"IF(U235-Y235>0,U235-Y235,0)","v":0}]
[{"$nulls":13},"Volvo EX30 69 kWh (alle Versionen)",35117.65,41790,"Mercedes Benz GLA 180",34425,40965.75,693,824,"Geländewagen / SUV","PKW","2024-02-15",6000,0,0]
[{"$nulls":13},"Volvo C40 Recharge Pure Electric (alle Versionen)",39915.97,47500,"Volvo XC40 B4",39453.78,46950,462,550,"Geländewagen / SUV","PKW","2024-02-15",{"$f":"IF(O237>=40000,5000,6000)","v":6000},{"$f":"IF(T237-Y237>0,T237-Y237,0)","v":0},{"$f":"IF(U237-Y237>0,U237-Y237,0)","v":0}]
[{"$nulls":13},"Volvo XC40 Recharge Pure Electric (alle Versionen)",52100.84,{"$f":"ROUND(O238*1.19,2)","v":62000},"Volvo XC40 B5 AWD",43403.360000000001,{"$f":"ROUND(R238*1.19,2)","v":51650},{"$f":"ROUND(O238-R238,0)","v":8697},{"$f":"ROUND(P238-S238,0)","v":10350},"Geländewagen / SUV","PKW","2020-12-22",{"$f":"IF(O238>=40000,5000,6000)","v":5000},{"$f":"IF(T238-Y238>0,T238-Y238,0)","v":3697},{"$f":"IF(U238-Y238>0,U238-Y238,0)","v":5350}]
[{"$nulls":13},"Volvo EX90","nicht förderfähig gemäß Aufruf","nicht förderfähig gemäß Aufruf",null,null,null,0,0,"Geländewagen / SUV","PKW","2024-02-15"]
[{"$nulls":13},"ZEEKR X Long Range (alle Versionen)",{"$f":"ROUND(P240/1.19,2)","v":37806.720000000001},44990,"Volvo XC40 B4",{"$f":"ROUND(S240/1.19,2)","v":39453.78},46950,{"$f":"IF(O240-R240>=0,ROUND(O240-R240,0),0)","v":0},0,"Geländewagen / SUV","PKW","2024-03-13",{"$f":"IF(O240>=40000,5000,6000)","v":6000},{"$f":"IF(P240>=40000,5000,6000)","v":5000},{"$f":"IF(Q240>=40000,5000,6000)","v":5000}]
[{"$nulls":13},"ZEEKR 001",{"$f":"ROUND(P241/1.19,2)","v":50336.13},59900,"Audi A6 40TDI S tronic",{"$f":"ROUND(S241/1.19,2)","v":47142.86},56100,{"$f":"IF(O241-R241>=0,ROUND(O241-R241,0),0)","v":3193},3800,"Mittelklasse","PKW","2024-02-15",5000,{"$f":"IF(T241-Y241>0,T241-Y241,0)","v":0},{"$f":"IF(U241-Y241>0,U241-Y241,0)","v":0}]
[{"$nulls":13},"Fahrzeugsegment Leichtfahrzeug","*","*","z.B. Renault Twizzy Life, Aixam eCity…","*","*",{"$f":"ROUND(U242/1.19,0)","v":22498},{"$f":"GETPIVOTDATA(\"förderfähig brutto\",$N$255,\"Info Segment\",V242)","v":26773},"Leichtfahrzeug","LFZ",null,0,"Abrechnung n. Typ","Abrechnung n. Typ"]
[{"$nulls":13},"Fahrzeugsegment Kleinwagen","*","*","z.B. BMW i3, Renault Zoe…","*","*",{"$f":"ROUND(U243/1.19,0)","v":13487},{"$f":"GETPIVOTDATA(\"förderfähig brutto\",$N$255,\"Info Segment\",V243)","v":16050},"Kleinwagen","PKW",null,0,"Abrechnung n. Typ","Abrechnung n. Typ"]
[{"$nulls":13},"Fahrzeugsegment Kompaktklasse","*","*","z.B. Nissan Leaf, VW e-Golf…","*","*",15210,18100,"Kompaktklasse","PKW",null,0,"Abrechnung n. Typ","Abrechnung n. Typ"]
[{"$nulls":13},"Fahrzeugsegment Mini","*","*","z.B. VW e-up, Citroën C-Zero…","*","*",15126,18000,"Mini","PKW",null,0,"Abrechnung n. Typ","Abrechnung n. Typ"]
[{"$nulls":13},"Fahrzeugsegment Mittelklasse","*","*","z.B. Polestar 2, Tesla Model 3…","*","*",10773,12820,"Mittelklasse","PKW",null,0,"Abrechnung n. Typ","Abrechnung n. Typ"]
[{"$nulls":13},"Fahrzeugsegment Mini-Van","*","*","z.B. Kia e-Soul…","*","*",9076,10800,"Mini-Van","PKW",null,0,"Abrechnung n. Typ","Abrechnung n. Typ"]
[{"$nulls":13},"Fahrzeugsegment Großraum-Van","*","*","z.B. Fiat E-Ducato Kombi","*","*",34950,41591,"Großraum-Van","PKW",null,0,"Abrechnung n. Typ","Abrechnung n. Typ"]
[{"$nulls":13},"Fahrzeugsegment Geländewagen / SUV","*","*","z.B. Peugeot e-2008, Hyundai Kona Elektro …","*","*",16042,19090,"Geländewagen / SUV","PKW",null,0,"Abrechnung n. Typ","Abrechnung n. Typ"]
[]
[]
[]
[]
[]
[{"$nulls":13},"Maximum von förderfähig brutto"]
[{"$nulls":13},"Info Segment","Ergebnis"]
[{"$nulls":13},"Kleinwagen",16050]
[{"$nulls":13},"Kompaktklasse",18100]
[{"$nulls":13},"Leichtfahrzeug",26773]
[{"$nulls":13},"Mini",18000]
[{"$nulls":13},"Mini-Van",10800]
[{"$nulls":13},"Mittelklasse",12820]
[{"$nulls":13},"Oberklasse"]
[{"$nulls":13},"Geländewagen / SUV",19090]
[{"$nulls":13},"Großraum-Van",41591]
[{"$nulls":13},"Gesamtergebnis",41591]

{"sheet":"Sonderfahrzeuge","index":2,"n_rows":29,"n_cols":11,"rows_kept":29,"cut":false,"hidden":false,"merged":[[2,0,2,9],[3,0,3,9]]}
["Ermittlung der förderfähigen Ausgaben (EfA) für Sonderfahrzeuge",{"$nulls":9},{"$f":"IF(Fahrzeuge!$L$1=0, \" \",\"FKZ: 03EMI4\"&Fahrzeuge!$L$1)","v":" "}]
["Hinweise:"]
["Hierfür müssen Sie entsprechende Angebote für das E-Fahrzeug und ein Referenzfahrzeug eingeholt haben. Diese Angebote sind beizufügen."]
[{"$f":"IF(Fahrzeuge!C6=\"\",\"Bitte geben Sie auf der Registerkarte 'Fahrzeuge'  an, ob Sie zum Vorsteuerabzug berechtigt sind.\",\"\")","v":"Bitte geben Sie auf der Registerkarte 'Fahrzeuge'  an, ob Sie zum Vorsteuerabzug berechtigt sind."}]
[]
["Pos.","Typ E-Fahrzeug",{"$f":"IF(Fahrzeuge!$C$6=\"nein\",\"Bruttopreis\nE-Fahrzeug laut beigefügtem Angebot *\",IF(Fahrzeuge!$C$6=\"ja\",\"Nettopreis\nE-Fahrzeug laut beigefügtem Angebot *\",\"Bitte wählen sie aus, ob sie zum Vorsteuerabzug berechtigt sind!\"))","v":"Bitte wählen sie aus, ob sie zum Vorsteuerabzug berechtigt sind!"},"Typ Referenzfahrzeug",{"$f":"IF(Fahrzeuge!$C$6=\"nein\",\"Bruttopreis Referenzfahrzeug\nlaut beigefügtem Angebot *\",IF(Fahrzeuge!$C$6=\"ja\",\"Nettopreis Referenzfahrzeug\nlaut beigefügtem Angebot *\",\"Bitte wählen sie aus, ob sie zum Vorsteuerabzug berechtigt sind!\"))","v":"Bitte wählen sie aus, ob sie zum Vorsteuerabzug berechtigt sind!"},{"$f":"IF(Fahrzeuge!$C$6=\"nein\",\"Förderfähige Ausgaben pro Fahrzeug (brutto)\",IF(Fahrzeuge!$C$6=\"ja\",\"Förderfähige Ausgaben pro Fahrzeug (netto)\",\"Bitte wählen sie aus, ob sie zum Vorsteuerabzug berechtigt sind!\"))","v":"Bitte wählen sie aus, ob sie zum Vorsteuerabzug berechtigt sind!"},"Anzahl zu beschaffender Fahrzeuge des Typs","erwartete durchschnittliche Jahres-Fahrleistung in km*","* alternativ: erwartete Jahresbetriebs-stunden","Förderfähige Ausgaben ","Korrekturfeld PtJ"]
[1,{"$nulls":4},{"$f":"IF(B7>\"\",IF($A$4=\"\",C7-E7,$F$6),\"\")","v":""},null,null,null,{"$f":"IF(B7>\"\",F7*G7,\"\")","v":""}]
[]
[2,{"$nulls":4},{"$f":"IF(B9>\"\",IF($A$4=\"\",C9-E9,$F$6),\"\")","v":""},null,null,null,{"$f":"IF(B9>\"\",F9*G9,\"\")","v":""}]
[]
[3,{"$nulls":4},"",null,null,null,""]
[]
[4,{"$nulls":4},"",null,null,null,""]
[]
[5,{"$nulls":4},"",null,null,null,""]
[]
[6,{"$nulls":4},"",null,null,null,""]
[]
[7,{"$nulls":4},"",null,null,null,""]
[]
[8,{"$nulls":4},"",null,null,null,""]
[]
[9,{"$nulls":4},"",null,null,null,""]
[]
[10,{"$nulls":4},"",null,null,null,""]
[]
["Summe",{"$nulls":5},{"$f":"IF(COUNTA(G7:G25)=COUNTA(H7:I25),\"\",\"Anzahl oder Angabe Fahrleistung / Betr.-Std. fehlt oder doppelt\")","v":""},{"$f":"IFERROR(\"Ø: \"&TEXT((SUMPRODUCT($G7:$G25,H7:H25)/SUMIFS($G7:$G25,H7:H25,\">0\")),\"#.##0\"),\"\")","v":""},{"$f":"IFERROR(\"Ø: \"&TEXT((SUMPRODUCT($G7:$G25,I7:I25)/SUMIFS($G7:$G25,I7:I25,\">0\")),\"#.##0\"),\"\")","v":""},{"$f":"SUM(J7:J25)","v":0}]
[]
["* Für Fahrzeuge, bei denen eine Jahresfahrleistung keine Relevanz hat, können auch die jährlichen Betriebsstunden angesetzt werden (z.B. bei Staplerfahrzeugen mit Li-Batterie)"]

{"sheet":"Ladeinfrastruktur","index":3,"n_rows":52,"n_cols":11,"rows_kept":52,"cut":false,"hidden":false,"merged":[[2,0,2,5],[27,1,27,5]]}
["Ermittlung der förderfähigen Ausgaben (EfA) - Pauschalen für Ladeinfrastruktur",{"$nulls":4},{"$f":"IF(Fahrzeuge!$L$1=0, \" \",\"FKZ: 03EMI4\"&Fahrzeuge!$L$1)","v":" "}]
[{"$f":"IF(Fahrzeuge!C6=\"\",\"Hinweis:\",\"\")","v":"Hinweis:"}]
[{"$f":"IF(Fahrzeuge!C6=\"\",\"Bitte geben Sie auf der Registerkarte 'Fahrzeuge'  an, ob Sie zum Vorsteuerabzug berechtigt sind\",\"\")","v":"Bitte geben Sie auf der Registerkarte 'Fahrzeuge'  an, ob Sie zum Vorsteuerabzug berechtigt sind"}]
[]
["Pos.","Typ Ladeinfrastruktur (LIS)*\n[Auswahlbox]",{"$f":"IF(Fahrzeuge!$C$6=\"nein\",\"Förderfähige Ausgaben pro Ladesäule (brutto)\",IF(Fahrzeuge!$C$6=\"ja\",\"Förderfähige Ausgaben pro Ladesäule (netto)\",\"Bitte wählen sie aus, ob sie zum Vorsteuerabzug berechtigt sind!\"))","v":"Bitte wählen sie aus, ob sie zum Vorsteuerabzug berechtigt sind!"},"Anzahl zu beschaffender Ladesäulen des Typs","Förderfähige Ausgaben ","Korrekturfeld PtJ"]
[1,null,{"$f":"IF($B6>0,IF(Fahrzeuge!$C$6=\"nein\",VLOOKUP($B6,$I$40:$K$52,3,0),IF(Fahrzeuge!$C$6=\"ja\",VLOOKUP($B6,$I$40:$K$52,2,0),\"Bitte wählen sie aus, ob sie zum Vorsteuerabzug berechtigt sind!\")),\"\")","v":""},null,{"$f":"IF(D6>0,C6*D6,\"\")","v":""}]
[]
[2,null,{"$f":"IF($B8>0,IF(Fahrzeuge!$C$6=\"nein\",VLOOKUP($B8,$I$40:$K$52,3,0),IF(Fahrzeuge!$C$6=\"ja\",VLOOKUP($B8,$I$40:$K$52,2,0),\"Bitte wählen sie aus, ob sie zum Vorsteuerabzug berechtigt sind!\")),\"\")","v":""},null,{"$f":"IF(D8>0,C8*D8,\"\")","v":""}]
[]
[3,null,{"$f":"IF($B10>0,IF(Fahrzeuge!$C$6=\"nein\",VLOOKUP($B10,$I$40:$K$52,3,0),IF(Fahrzeuge!$C$6=\"ja\",VLOOKUP($B10,$I$40:$K$52,2,0),\"Bitte wählen sie aus, ob sie zum Vorsteuerabzug berechtigt sind!\")),\"\")","v":""},null,{"$f":"IF(D10>0,C10*D10,\"\")","v":""}]
[]
[4,null,{"$f":"IF($B12>0,IF(Fahrzeuge!$C$6=\"nein\",VLOOKUP($B12,$I$40:$K$52,3,0),IF(Fahrzeuge!$C$6=\"ja\",VLOOKUP($B12,$I$40:$K$52,2,0),\"Bitte wählen sie aus, ob sie zum Vorsteuerabzug berechtigt sind!\")),\"\")","v":""},null,{"$f":"IF(D12>0,C12*D12,\"\")","v":""}]
[]
[5,null,{"$f":"IF($B14>0,IF(Fahrzeuge!$C$6=\"nein\",VLOOKUP($B14,$I$40:$K$52,3,0),IF(Fahrzeuge!$C$6=\"ja\",VLOOKUP($B14,$I$40:$K$52,2,0),\"Bitte wählen sie aus, ob sie zum Vorsteuerabzug berechtigt sind!\")),\"\")","v":""},null,{"$f":"IF(D14>0,C14*D14,\"\")","v":""}]
[]
[6,null,{"$f":"IF($B16>0,IF(Fahrzeuge!$C$6=\"nein\",VLOOKUP($B16,$I$40:$K$52,3,0),IF(Fahrzeuge!$C$6=\"ja\",VLOOKUP($B16,$I$40:$K$52,2,0),\"Bitte wählen sie aus, ob sie zum Vorsteuerabzug berechtigt sind!\")),\"\")","v":""},null,{"$f":"IF(D16>0,C16*D16,\"\")","v":""}]
[]
[7,null,{"$f":"IF($B18>0,IF(Fahrzeuge!$C$6=\"nein\",VLOOKUP($B18,$I$40:$K$52,3,0),IF(Fahrzeuge!$C$6=\"ja\",VLOOKUP($B18,$I$40:$K$52,2,0),\"Bitte wählen sie aus, ob sie zum Vorsteuerabzug berechtigt sind!\")),\"\")","v":""},null,{"$f":"IF(D18>0,C18*D18,\"\")","v":""}]
[]
[8,null,{"$f":"IF($B20>0,IF(Fahrzeuge!$C$6=\"nein\",VLOOKUP($B20,$I$40:$K$52,3,0),IF(Fahrzeuge!$C$6=\"ja\",VLOOKUP($B20,$I$40:$K$52,2,0),\"Bitte wählen sie aus, ob sie zum Vorsteuerabzug berechtigt sind!\")),\"\")","v":""},null,{"$f":"IF(D20>0,C20*D20,\"\")","v":""}]
[]
[9,null,{"$f":"IF($B22>0,IF(Fahrzeuge!$C$6=\"nein\",VLOOKUP($B22,$I$40:$K$52,3,0),IF(Fahrzeuge!$C$6=\"ja\",VLOOKUP($B22,$I$40:$K$52,2,0),\"Bitte wählen sie aus, ob sie zum Vorsteuerabzug berechtigt sind!\")),\"\")","v":""},null,{"$f":"IF(D22>0,C22*D22,\"\")","v":""}]
[]
[10,null,{"$f":"IF($B24>0,IF(Fahrzeuge!$C$6=\"nein\",VLOOKUP($B24,$I$40:$K$52,3,0),IF(Fahrzeuge!$C$6=\"ja\",VLOOKUP($B24,$I$40:$K$52,2,0),\"Bitte wählen sie aus, ob sie zum Vorsteuerabzug berechtigt sind!\")),\"\")","v":""},null,{"$f":"IF(D24>0,C24*D24,\"\")","v":""}]
[]
["Summe",null,null,null,{"$f":"SUM(E6:E24)","v":0}]
[]
["* öff. zugängl.:"," öffentlich zugängliche Ladepunkte im Sinne der Verordnung über technische Mindestanforderungen an den sicheren und interoperablen Aufbau und Betrieb von öffentlich zugänglichen Ladepunkten für Elektromobile (siehe Anlage 3 zum Förderaufruf)"]
["* nicht. öff. zugängl.:","LIS ist für die Öffentlichkeit nicht zugänglich"]
["* DC :","Gleichstrom-Ladeinfrastruktur"]
["* AC :","Wechselstrom-Ladeinfrastruktur"]
{"$rows_empty":7}
[{"$nulls":8},"Typ Ladeinfrastruktur","Ausgabenpauschale netto","Ausgabenpauschale brutto"]
[{"$nulls":8},"Mobile Ladestationen [AC] ab 3,7 kW (1 Ladepunkt)",500,{"$f":"J40*1.19","v":595}]
[{"$nulls":8},"nicht öff. zugängl. [AC] ab 3,7 kW (1 Ladepunkt)",600,714]
[{"$nulls":8},"nicht öff. zugängl. [AC] ab 11 kW (min. 2 Ladepunkte)",3000,3570]
[{"$nulls":8},"nicht öff. zugängl. [DC] bis 25 kW ",10000,11900]
[{"$nulls":8},"nicht öff. zugängl. [DC] 25-50 kW",20000,23800]
[{"$nulls":8},"nicht öff. zugängl. [DC] 51-149 kW",35000,41650]
[{"$nulls":8},"nicht öff. zugängl. [DC] ab 150 kW",50000,59500]
[{"$nulls":8},"öff. zugängl. [AC] ab 3,7 kW (1 Ladepunkt)",{"$f":"J41","v":600},714]
[{"$nulls":8},"öff. zugängl. [AC] ab 11 kW (min. 2 Ladepunkte)",{"$f":"J42","v":3000},{"$f":"J48*1.19","v":3570}]
[{"$nulls":8},"öff. zugängl. [DC] bis 25 kW ",10000,11900]
[{"$nulls":8},"öff. zugängl. [DC] 25-50 kW",{"$f":"J44","v":20000},23800]
[{"$nulls":8},"öff. zugängl. [DC] 51-149 kW",{"$f":"J45","v":35000},41650]
[{"$nulls":8},"öff. zugängl. [DC] ab 150 kW",{"$f":"J46","v":50000},59500]

{"sheet":"spezielle Ladeinfrastruktur","index":4,"n_rows":27,"n_cols":6,"rows_kept":27,"cut":false,"hidden":false,"merged":[[27,0,27,5],[2,0,2,6],[0,0,0,3]]}
["Ermittlung der förderfähigen Ausgaben für Ladeinfrastruktur, die nicht in der Registerkarte \"Ladeinfrastruktur\" aufgeführt wird",{"$nulls":4},{"$f":"IF(Fahrzeuge!$L$1=0, \" \",\"FKZ: 03EMI4\"&Fahrzeuge!$L$1)","v":" "}]
["Hinweise:"]
["Hierfür müssen Sie entsprechende Angebote für die Ladeinfrastruktur eingeholt haben. Diese Angebote sind beizufügen."]
[{"$f":"IF(Fahrzeuge!C6=\"\",\"Bitte geben Sie auf der Registerkarte 'Fahrzeuge'  an, ob Sie zum Vorsteuerabzug berechtigt sind\",\"\")","v":"Bitte geben Sie auf der Registerkarte 'Fahrzeuge'  an, ob Sie zum Vorsteuerabzug berechtigt sind"}]
[]
["Pos.","Typ Ladeinfrastruktur (LIS)",{"$f":"IF(Fahrzeuge!$C$6=\"nein\",\"Bruttopreis LIS laut beigefügtem Angebot *\",IF(Fahrzeuge!$C$6=\"ja\",\"Nettopreis LIS laut beigefügtem Angebot *\",\"Bitte wählen sie aus, ob sie zum Vorsteuerabzug berechtigt sind!\"))","v":"Bitte wählen sie aus, ob sie zum Vorsteuerabzug berechtigt sind!"},"Anzahl zu beschaffender LIS dieses Typs","Förderfähige Ausgaben ","Korrekturfeld PtJ"]
[1,null,null,null,{"$f":"IF(C7>0,D7*C7,\"\")","v":""}]
[]
[2,null,null,null,{"$f":"IF(C9>0,D9*C9,\"\")","v":""}]
[]
[3,null,null,null,{"$f":"IF(C11>0,D11*C11,\"\")","v":""}]
[]
[4,null,null,null,{"$f":"IF(C13>0,D13*C13,\"\")","v":""}]
[]
[5,null,null,null,{"$f":"IF(C15>0,D15*C15,\"\")","v":""}]
[]
[6,null,null,null,{"$f":"IF(C17>0,D17*C17,\"\")","v":""}]
[]
[7,null,null,null,{"$f":"IF(C19>0,D19*C19,\"\")","v":""}]
[]
[8,null,null,null,{"$f":"IF(C21>0,D21*C21,\"\")","v":""}]
[]
[9,null,null,null,{"$f":"IF(C23>0,D23*C23,\"\")","v":""}]
[]
[10,null,null,null,{"$f":"IF(C25>0,D25*C25,\"\")","v":""}]
[]
["Summe",null,null,null,{"$f":"IF(C7>0,SUM(E7:E25),\"\")","v":""}]

{"sheet":"Vorlage für AZA","index":5,"n_rows":67,"n_cols":5,"rows_kept":67,"cut":false,"hidden":false,"merged":[[1,0,1,4],[5,0,5,4],[8,0,8,4]]}
["Hinweis:",null,null,null,{"$f":"IF(Fahrzeuge!$L$1=0, \" \",\"FKZ: 03EMI4\"&Fahrzeuge!$L$1)","v":" "}]
["Vorlage zum Übertragen der Daten aus dieser Tabelle in den AZA-Antrag in easy-Online. "]
["Bitte kopieren Sie die Bezeichung wie hier dargestellt in das easy-Online-Formular. "]
["Die Anzahl der zu beschaffenden Fahrzeuge/ Ladeinfrastruktur muss ggf. auf die Anschaffungsjahre aufgeteilt werden."]
["Beachten Sie, dass die hier angegebene Summe mit den Gesamtmitteln im easy-Online-Antrag überein stimmen müssen."]
[{"$f":"IF(Fahrzeuge!$C$6=\"nein\",\"Der Antragsteller ist nicht zum Vorsteuerabzug berechtigt.\",IF(Fahrzeuge!$C$6=\"ja\",\"Der Antragsteller ist zum Vorsteuerabzug berechtigt.\",\"Bitte wählen sie aus, ob sie zum Vorsteuerabzug berechtigt sind!\"))","v":"Bitte wählen sie aus, ob sie zum Vorsteuerabzug berechtigt sind!"}]
["(sollte diese Aussage nicht zutreffen, wählen Sie bitte die entsprechende Option auf der Registerkarte \"Fahrzeuge\")"]
[]
["Gesamtfinanzierung - Gegenstände und andere Investitionen von mehr als 410 € im Einzelfall"]
[]
["lfd. Nr.","Bezeichnung","Zuwendungsfähige\nAusgaben / Stück","Anzahl","F0833 Betrag €"]
[{"$f":"IF(Fahrzeuge!$B15>\"\",Fahrzeuge!A15,0)","v":0},{"$f":"IF(Fahrzeuge!$B15>\"\",CONCATENATE(Fahrzeuge!AI15,\" \",Fahrzeuge!B15),\"\")","v":""},{"$f":"IF(Fahrzeuge!$B15>\"\",Fahrzeuge!G15,\"\")","v":""},{"$f":"IF(Fahrzeuge!$B15>\"\",Fahrzeuge!I15,\"\")","v":""},{"$f":"IF(Fahrzeuge!$B15>\"\",Fahrzeuge!K15,\"\")","v":""}]
[{"$f":"IF(Fahrzeuge!B16>\"\",Fahrzeuge!A16,A12)","v":0},{"$f":"IF(Fahrzeuge!$B16>\"\",CONCATENATE(Fahrzeuge!AI16,\" \",Fahrzeuge!B16),\"\")","v":""},{"$f":"IF(Fahrzeuge!$B16>\"\",Fahrzeuge!G16,\"\")","v":""},{"$f":"IF(Fahrzeuge!$B16>\"\",Fahrzeuge!I16,\"\")","v":""},{"$f":"IF(Fahrzeuge!$B16>\"\",Fahrzeuge!K16,\"\")","v":""}]
[{"$f":"IF(Fahrzeuge!B17>\"\",Fahrzeuge!A17,A13)","v":0},{"$f":"IF(Fahrzeuge!$B17>\"\",CONCATENATE(Fahrzeuge!AI17,\" \",Fahrzeuge!B17),\"\")","v":""},{"$f":"IF(Fahrzeuge!$B17>\"\",Fahrzeuge!G17,\"\")","v":""},{"$f":"IF(Fahrzeuge!$B17>\"\",Fahrzeuge!I17,\"\")","v":""},{"$f":"IF(Fahrzeuge!$B17>\"\",Fahrzeuge!K17,\"\")","v":""}]
[{"$f":"IF(Fahrzeuge!B18>\"\",Fahrzeuge!A18,A14)","v":0},{"$f":"IF(Fahrzeuge!$B18>\"\",CONCATENATE(Fahrzeuge!AI18,\" \",Fahrzeuge!B18),\"\")","v":""},{"$f":"IF(Fahrzeuge!$B18>\"\",Fahrzeuge!G18,\"\")","v":""},{"$f":"IF(Fahrzeuge!$B18>\"\",Fahrzeuge!I18,\"\")","v":""},{"$f":"IF(Fahrzeuge!$B18>\"\",Fahrzeuge!K18,\"\")","v":""}]
[{"$f":"IF(Fahrzeuge!B19>\"\",Fahrzeuge!A19,A15)","v":0},{"$f":"IF(Fahrzeuge!$B19>\"\",CONCATENATE(Fahrzeuge!AI19,\" \",Fahrzeuge!B19),\"\")","v":""},{"$f":"IF(Fahrzeuge!$B19>\"\",Fahrzeuge!G19,\"\")","v":""},{"$f":"IF(Fahrzeuge!$B19>\"\",Fahrzeuge!I19,\"\")","v":""},{"$f":"IF(Fahrzeuge!$B19>\"\",Fahrzeuge!K19,\"\")","v":""}]
[{"$f":"IF(Fahrzeuge!B20>\"\",Fahrzeuge!A20,A16)","v":0},{"$f":"IF(Fahrzeuge!$B20>\"\",CONCATENATE(Fahrzeuge!AI20,\" \",Fahrzeuge!B20),\"\")","v":""},{"$f":"IF(Fahrzeuge!$B20>\"\",Fahrzeuge!G20,\"\")","v":""},{"$f":"IF(Fahrzeuge!$B20>\"\",Fahrzeuge!I20,\"\")","v":""},{"$f":"IF(Fahrzeuge!$B20>\"\",Fahrzeuge!K20,\"\")","v":""}]
[{"$f":"IF(Fahrzeuge!B21>\"\",Fahrzeuge!A21,A17)","v":0},{"$f":"IF(Fahrzeuge!$B21>\"\",CONCATENATE(Fahrzeuge!AI21,\" \",Fahrzeuge!B21),\"\")","v":""},{"$f":"IF(Fahrzeuge!$B21>\"\",Fahrzeuge!G21,\"\")","v":""},{"$f":"IF(Fahrzeuge!$B21>\"\",Fahrzeuge!I21,\"\")","v":""},{"$f":"IF(Fahrzeuge!$B21>\"\",Fahrzeuge!K21,\"\")","v":""}]
[{"$f":"IF(Fahrzeuge!B22>\"\",Fahrzeuge!A22,A18)","v":0},{"$f":"IF(Fahrzeuge!$B22>\"\",CONCATENATE(Fahrzeuge!AI22,\" \",Fahrzeuge!B22),\"\")","v":""},{"$f":"IF(Fahrzeuge!$B22>\"\",Fahrzeuge!G22,\"\")","v":""},{"$f":"IF(Fahrzeuge!$B22>\"\",Fahrzeuge!I22,\"\")","v":""},{"$f":"IF(Fahrzeuge!$B22>\"\",Fahrzeuge!K22,\"\")","v":""}]
[{"$f":"IF(Fahrzeuge!B23>\"\",Fahrzeuge!A23,A19)","v":0},{"$f":"IF(Fahrzeuge!$B23>\"\",CONCATENATE(Fahrzeuge!AI23,\" \",Fahrzeuge!B23),\"\")","v":""},{"$f":"IF(Fahrzeuge!$B23>\"\",Fahrzeuge!G23,\"\")","v":""},{"$f":"IF(Fahrzeuge!$B23>\"\",Fahrzeuge!I23,\"\")","v":""},{"$f":"IF(Fahrzeuge!$B23>\"\",Fahrzeuge!K23,\"\")","v":""}]
[{"$f":"IF(Fahrzeuge!B24>\"\",Fahrzeuge!A24,A20)","v":0},{"$f":"IF(Fahrzeuge!$B24>\"\",CONCATENATE(Fahrzeuge!AI24,\" \",Fahrzeuge!B24),\"\")","v":""},{"$f":"IF(Fahrzeuge!$B24>\"\",Fahrzeuge!G24,\"\")","v":""},{"$f":"IF(Fahrzeuge!$B24>\"\",Fahrzeuge!I24,\"\")","v":""},{"$f":"IF(Fahrzeuge!$B24>\"\",Fahrzeuge!K24,\"\")","v":""}]
[{"$f":"IF(Fahrzeuge!B25>\"\",Fahrzeuge!A25,A21)","v":0},{"$f":"IF(Fahrzeuge!$B25>\"\",CONCATENATE(Fahrzeuge!AI25,\" \",Fahrzeuge!B25),\"\")","v":""},{"$f":"IF(Fahrzeuge!$B25>\"\",Fahrzeuge!G25,\"\")","v":""},{"$f":"IF(Fahrzeuge!$B25>\"\",Fahrzeuge!I25,\"\")","v":""},{"$f":"IF(Fahrzeuge!$B25>\"\",Fahrzeuge!K25,\"\")","v":""}]
[{"$f":"IF(Fahrzeuge!B26>\"\",Fahrzeuge!A26,A22)","v":0},{"$f":"IF(Fahrzeuge!$B26>\"\",CONCATENATE(Fahrzeuge!AI26,\" \",Fahrzeuge!B26),\"\")","v":""},{"$f":"IF(Fahrzeuge!$B26>\"\",Fahrzeuge!G26,\"\")","v":""},{"$f":"IF(Fahrzeuge!$B26>\"\",Fahrzeuge!I26,\"\")","v":""},{"$f":"IF(Fahrzeuge!$B26>\"\",Fahrzeuge!K26,\"\")","v":""}]
[{"$f":"IF(Fahrzeuge!B27>\"\",Fahrzeuge!A27,A23)","v":0},{"$f":"IF(Fahrzeuge!$B27>\"\",CONCATENATE(Fahrzeuge!AI27,\" \",Fahrzeuge!B27),\"\")","v":""},{"$f":"IF(Fahrzeuge!$B27>\"\",Fahrzeuge!G27,\"\")","v":""},{"$f":"IF(Fahrzeuge!$B27>\"\",Fahrzeuge!I27,\"\")","v":""},{"$f":"IF(Fahrzeuge!$B27>\"\",Fahrzeuge!K27,\"\")","v":""}]
[{"$f":"IF(Fahrzeuge!B28>\"\",Fahrzeuge!A28,A24)","v":0},{"$f":"IF(Fahrzeuge!$B28>\"\",CONCATENATE(Fahrzeuge!AI28,\" \",Fahrzeuge!B28),\"\")","v":""},{"$f":"IF(Fahrzeuge!$B28>\"\",Fahrzeuge!G28,\"\")","v":""},{"$f":"IF(Fahrzeuge!$B28>\"\",Fahrzeuge!I28,\"\")","v":""},{"$f":"IF(Fahrzeuge!$B28>\"\",Fahrzeuge!K28,\"\")","v":""}]
[{"$f":"IF(Fahrzeuge!B29>\"\",Fahrzeuge!A29,A25)","v":0},{"$f":"IF(Fahrzeuge!$B29>\"\",CONCATENATE(Fahrzeuge!AI29,\" \",Fahrzeuge!B29),\"\")","v":""},{"$f":"IF(Fahrzeuge!$B29>\"\",Fahrzeuge!G29,\"\")","v":""},{"$f":"IF(Fahrzeuge!$B29>\"\",Fahrzeuge!I29,\"\")","v":""},{"$f":"IF(Fahrzeuge!$B29>\"\",Fahrzeuge!K29,\"\")","v":""}]
[{"$f":"IF(Fahrzeuge!B30>\"\",Fahrzeuge!A30,A26)","v":0},{"$f":"IF(Fahrzeuge!$B30>\"\",CONCATENATE(Fahrzeuge!AI30,\" \",Fahrzeuge!B30),\"\")","v":""},{"$f":"IF(Fahrzeuge!$B30>\"\",Fahrzeuge!G30,\"\")","v":""},{"$f":"IF(Fahrzeuge!$B30>\"\",Fahrzeuge!I30,\"\")","v":""},{"$f":"IF(Fahrzeuge!$B30>\"\",Fahrzeuge!K30,\"\")","v":""}]
[{"$f":"IF(Fahrzeuge!B31>\"\",Fahrzeuge!A31,A27)","v":0},{"$f":"IF(Fahrzeuge!$B31>\"\",CONCATENATE(Fahrzeuge!AI31,\" \",Fahrzeuge!B31),\"\")","v":""},{"$f":"IF(Fahrzeuge!$B31>\"\",Fahrzeuge!G31,\"\")","v":""},{"$f":"IF(Fahrzeuge!$B31>\"\",Fahrzeuge!I31,\"\")","v":""},{"$f":"IF(Fahrzeuge!$B31>\"\",Fahrzeuge!K31,\"\")","v":""}]
[{"$f":"IF(Fahrzeuge!B32>\"\",Fahrzeuge!A32,A28)","v":0},{"$f":"IF(Fahrzeuge!$B32>\"\",CONCATENATE(Fahrzeuge!AI32,\" \",Fahrzeuge!B32),\"\")","v":""},{"$f":"IF(Fahrzeuge!$B32>\"\",Fahrzeuge!G32,\"\")","v":""},{"$f":"IF(Fahrzeuge!$B32>\"\",Fahrzeuge!I32,\"\")","v":""},{"$f":"IF(Fahrzeuge!$B32>\"\",Fahrzeuge!K32,\"\")","v":""}]
[{"$f":"IF(Fahrzeuge!B33>\"\",Fahrzeuge!A33,A29)","v":0},{"$f":"IF(Fahrzeuge!$B33>\"\",CONCATENATE(Fahrzeuge!AI33,\" \",Fahrzeuge!B33),\"\")","v":""},{"$f":"IF(Fahrzeuge!$B33>\"\",Fahrzeuge!G33,\"\")","v":""},{"$f":"IF(Fahrzeuge!$B33>\"\",Fahrzeuge!I33,\"\")","v":""},{"$f":"IF(Fahrzeuge!$B33>\"\",Fahrzeuge!K33,\"\")","v":""}]
[{"$f":"IF(Fahrzeuge!B34>\"\",Fahrzeuge!A34,A30)","v":0},{"$f":"IF(Fahrzeuge!$B34>\"\",CONCATENATE(Fahrzeuge!AI34,\" \",Fahrzeuge!B34),\"\")","v":""},{"$f":"IF(Fahrzeuge!$B34>\"\",Fahrzeuge!G34,\"\")","v":""},{"$f":"IF(Fahrzeuge!$B34>\"\",Fahrzeuge!I34,\"\")","v":""},{"$f":"IF(Fahrzeuge!$B34>\"\",Fahrzeuge!K34,\"\")","v":""}]
[{"$f":"IF(Sonderfahrzeuge!B7>\"\",A31+1,A31)","v":0},{"$f":"IF(Sonderfahrzeuge!$B7>\"\",CONCATENATE(\"LKW bzw. SFZ \",Sonderfahrzeuge!$B7),\"\")","v":""},{"$f":"IF(Sonderfahrzeuge!$B7>\"\",Sonderfahrzeuge!F7,\"\")","v":""},{"$f":"IF(Sonderfahrzeuge!$B7>\"\",Sonderfahrzeuge!G7,\"\")","v":""},{"$f":"IF(Sonderfahrzeuge!$B7>\"\",Sonderfahrzeuge!J7,\"\")","v":""}]
[{"$f":"IF(Sonderfahrzeuge!B9>\"\",A32+1,A32)","v":0},{"$f":"IF(Sonderfahrzeuge!$B9>\"\",CONCATENATE(\"LKW bzw. SFZ \",Sonderfahrzeuge!$B9),\"\")","v":""},{"$f":"IF(Sonderfahrzeuge!$B9>\"\",Sonderfahrzeuge!F9,\"\")","v":""},{"$f":"IF(Sonderfahrzeuge!$B9>\"\",Sonderfahrzeuge!G9,\"\")","v":""},{"$f":"IF(Sonderfahrzeuge!$B9>\"\",Sonderfahrzeuge!J9,\"\")","v":""}]
[{"$f":"IF(Sonderfahrzeuge!B11>\"\",A33+1,A33)","v":0},{"$f":"IF(Sonderfahrzeuge!$B11>\"\",CONCATENATE(\"LKW bzw. SFZ \",Sonderfahrzeuge!$B11),\"\")","v":""},{"$f":"IF(Sonderfahrzeuge!$B11>\"\",Sonderfahrzeuge!F11,\"\")","v":""},{"$f":"IF(Sonderfahrzeuge!$B11>\"\",Sonderfahrzeuge!G11,\"\")","v":""},{"$f":"IF(Sonderfahrzeuge!$B11>\"\",Sonderfahrzeuge!J11,\"\")","v":""}]
[{"$f":"IF(Sonderfahrzeuge!B13>\"\",A34+1,A34)","v":0},{"$f":"IF(Sonderfahrzeuge!$B13>\"\",CONCATENATE(\"LKW bzw. SFZ \",Sonderfahrzeuge!$B13),\"\")","v":""},{"$f":"IF(Sonderfahrzeuge!$B13>\"\",Sonderfahrzeuge!F13,\"\")","v":""},{"$f":"IF(Sonderfahrzeuge!$B13>\"\",Sonderfahrzeuge!G13,\"\")","v":""},{"$f":"IF(Sonderfahrzeuge!$B13>\"\",Sonderfahrzeuge!J13,\"\")","v":""}]
[{"$f":"IF(Sonderfahrzeuge!B15>\"\",A35+1,A35)","v":0},{"$f":"IF(Sonderfahrzeuge!$B15>\"\",CONCATENATE(\"LKW bzw. SFZ \",Sonderfahrzeuge!$B15),\"\")","v":""},{"$f":"IF(Sonderfahrzeuge!$B15>\"\",Sonderfahrzeuge!F15,\"\")","v":""},{"$f":"IF(Sonderfahrzeuge!$B15>\"\",Sonderfahrzeuge!G15,\"\")","v":""},{"$f":"IF(Sonderfahrzeuge!$B15>\"\",Sonderfahrzeuge!J15,\"\")","v":""}]
[{"$f":"IF(Sonderfahrzeuge!B17>\"\",A36+1,A36)","v":0},{"$f":"IF(Sonderfahrzeuge!$B17>\"\",CONCATENATE(\"LKW bzw. SFZ \",Sonderfahrzeuge!$B17),\"\")","v":""},{"$f":"IF(Sonderfahrzeuge!$B17>\"\",Sonderfahrzeuge!F17,\"\")","v":""},{"$f":"IF(Sonderfahrzeuge!$B17>\"\",Sonderfahrzeuge!G17,\"\")","v":""},{"$f":"IF(Sonderfahrzeuge!$B17>\"\",Sonderfahrzeuge!J17,\"\")","v":""}]
[{"$f":"IF(Sonderfahrzeuge!B19>\"\",A37+1,A37)","v":0},{"$f":"IF(Sonderfahrzeuge!$B19>\"\",CONCATENATE(\"LKW bzw. SFZ \",Sonderfahrzeuge!$B19),\"\")","v":""},{"$f":"IF(Sonderfahrzeuge!$B19>\"\",Sonderfahrzeuge!F19,\"\")","v":""},{"$f":"IF(Sonderfahrzeuge!$B19>\"\",Sonderfahrzeuge!G19,\"\")","v":""},{"$f":"IF(Sonderfahrzeuge!$B19>\"\",Sonderfahrzeuge!J19,\"\")","v":""}]
[{"$f":"IF(Sonderfahrzeuge!B21>\"\",A38+1,A38)","v":0},{"$f":"IF(Sonderfahrzeuge!$B21>\"\",CONCATENATE(\"LKW bzw. SFZ \",Sonderfahrzeuge!$B21),\"\")","v":""},{"$f":"IF(Sonderfahrzeuge!$B21>\"\",Sonderfahrzeuge!F21,\"\")","v":""},{"$f":"IF(Sonderfahrzeuge!$B21>\"\",Sonderfahrzeuge!G21,\"\")","v":""},{"$f":"IF(Sonderfahrzeuge!$B21>\"\",Sonderfahrzeuge!J21,\"\")","v":""}]
[{"$f":"IF(Sonderfahrzeuge!B23>\"\",A39+1,A39)","v":0},{"$f":"IF(Sonderfahrzeuge!$B23>\"\",CONCATENATE(\"LKW bzw. SFZ \",Sonderfahrzeuge!$B23),\"\")","v":""},{"$f":"IF(Sonderfahrzeuge!$B23>\"\",Sonderfahrzeuge!F23,\"\")","v":""},{"$f":"IF(Sonderfahrzeuge!$B23>\"\",Sonderfahrzeuge!G23,\"\")","v":""},{"$f":"IF(Sonderfahrzeuge!$B23>\"\",Sonderfahrzeuge!J23,\"\")","v":""}]
[{"$f":"IF(Sonderfahrzeuge!B25>\"\",A40+1,A40)","v":0},{"$f":"IF(Sonderfahrzeuge!$B25>\"\",CONCATENATE(\"LKW bzw. SFZ \",Sonderfahrzeuge!$B25),\"\")","v":""},{"$f":"IF(Sonderfahrzeuge!$B25>\"\",Sonderfahrzeuge!F25,\"\")","v":""},{"$f":"IF(Sonderfahrzeuge!$B25>\"\",Sonderfahrzeuge!G25,\"\")","v":""},{"$f":"IF(Sonderfahrzeuge!$B25>\"\",Sonderfahrzeuge!J25,\"\")","v":""}]
[{"$f":"IF(Ladeinfrastruktur!$B6>\"\",A41+1,A41)","v":0},{"$f":"IF(Ladeinfrastruktur!$B6>\"\",CONCATENATE(\" LIS \",Ladeinfrastruktur!B6),\"\")","v":""},{"$f":"IF($B42>\"\",Ladeinfrastruktur!C6,\"\")","v":""},{"$f":"IF($B42>\"\",Ladeinfrastruktur!D6,\"\")","v":""},{"$f":"IF($B42>\"\",Ladeinfrastruktur!E6,\"\")","v":""}]
[{"$f":"IF(Ladeinfrastruktur!$B8>\"\",A42+1,A42)","v":0},{"$f":"IF(Ladeinfrastruktur!$B8>\"\",CONCATENATE(\" LIS \",Ladeinfrastruktur!B8),\"\")","v":""},{"$f":"IF($B43>\"\",Ladeinfrastruktur!C8,\"\")","v":""},{"$f":"IF($B43>\"\",Ladeinfrastruktur!D8,\"\")","v":""},{"$f":"IF($B43>\"\",Ladeinfrastruktur!E8,\"\")","v":""}]
[{"$f":"IF(Ladeinfrastruktur!$B10>\"\",A43+1,A43)","v":0},{"$f":"IF(Ladeinfrastruktur!$B10>\"\",CONCATENATE(\" LIS \",Ladeinfrastruktur!B10),\"\")","v":""},{"$f":"IF($B44>\"\",Ladeinfrastruktur!C10,\"\")","v":""},{"$f":"IF($B44>\"\",Ladeinfrastruktur!D10,\"\")","v":""},{"$f":"IF($B44>\"\",Ladeinfrastruktur!E10,\"\")","v":""}]
[{"$f":"IF(Ladeinfrastruktur!$B12>\"\",A44+1,A44)","v":0},{"$f":"IF(Ladeinfrastruktur!$B12>\"\",CONCATENATE(\" LIS \",Ladeinfrastruktur!B12),\"\")","v":""},{"$f":"IF($B45>\"\",Ladeinfrastruktur!C12,\"\")","v":""},{"$f":"IF($B45>\"\",Ladeinfrastruktur!D12,\"\")","v":""},{"$f":"IF($B45>\"\",Ladeinfrastruktur!E12,\"\")","v":""}]
[{"$f":"IF(Ladeinfrastruktur!$B14>\"\",A45+1,A45)","v":0},{"$f":"IF(Ladeinfrastruktur!$B14>\"\",CONCATENATE(\" LIS \",Ladeinfrastruktur!B14),\"\")","v":""},{"$f":"IF($B46>\"\",Ladeinfrastruktur!C14,\"\")","v":""},{"$f":"IF($B46>\"\",Ladeinfrastruktur!D14,\"\")","v":""},{"$f":"IF($B46>\"\",Ladeinfrastruktur!E14,\"\")","v":""}]
[{"$f":"IF(Ladeinfrastruktur!$B16>\"\",A46+1,A46)","v":0},{"$f":"IF(Ladeinfrastruktur!$B16>\"\",CONCATENATE(\" LIS \",Ladeinfrastruktur!B16),\"\")","v":""},{"$f":"IF($B47>\"\",Ladeinfrastruktur!C16,\"\")","v":""},{"$f":"IF($B47>\"\",Ladeinfrastruktur!D16,\"\")","v":""},{"$f":"IF($B47>\"\",Ladeinfrastruktur!E16,\"\")","v":""}]
[{"$f":"IF(Ladeinfrastruktur!$B18>\"\",A47+1,A47)","v":0},{"$f":"IF(Ladeinfrastruktur!$B18>\"\",CONCATENATE(\" LIS \",Ladeinfrastruktur!B18),\"\")","v":""},{"$f":"IF($B48>\"\",Ladeinfrastruktur!C18,\"\")","v":""},{"$f":"IF($B48>\"\",Ladeinfrastruktur!D18,\"\")","v":""},{"$f":"IF($B48>\"\",Ladeinfrastruktur!E18,\"\")","v":""}]
[{"$f":"IF(Ladeinfrastruktur!$B20>\"\",A48+1,A48)","v":0},{"$f":"IF(Ladeinfrastruktur!$B20>\"\",CONCATENATE(\" LIS \",Ladeinfrastruktur!B20),\"\")","v":""},{"$f":"IF($B49>\"\",Ladeinfrastruktur!C20,\"\")","v":""},{"$f":"IF($B49>\"\",Ladeinfrastruktur!D20,\"\")","v":""},{"$f":"IF($B49>\"\",Ladeinfrastruktur!E20,\"\")","v":""}]
[{"$f":"IF(Ladeinfrastruktur!$B22>\"\",A49+1,A49)","v":0},{"$f":"IF(Ladeinfrastruktur!$B22>\"\",CONCATENATE(\" LIS \",Ladeinfrastruktur!B22),\"\")","v":""},{"$f":"IF($B50>\"\",Ladeinfrastruktur!C22,\"\")","v":""},{"$f":"IF($B50>\"\",Ladeinfrastruktur!D22,\"\")","v":""},{"$f":"IF($B50>\"\",Ladeinfrastruktur!E22,\"\")","v":""}]
[{"$f":"IF(Ladeinfrastruktur!$B24>\"\",A50+1,A50)","v":0},{"$f":"IF(Ladeinfrastruktur!$B24>\"\",CONCATENATE(\" LIS \",Ladeinfrastruktur!B24),\"\")","v":""},{"$f":"IF($B51>\"\",Ladeinfrastruktur!C24,\"\")","v":""},{"$f":"IF($B51>\"\",Ladeinfrastruktur!D24,\"\")","v":""},{"$f":"IF($B51>\"\",Ladeinfrastruktur!E24,\"\")","v":""}]
[{"$f":"IF('spezielle Ladeinfrastruktur'!$B7>\"\",A51+1,A51)","v":0},{"$f":"IF('spezielle Ladeinfrastruktur'!B7>\"\",CONCATENATE(\" LIS \",'spezielle Ladeinfrastruktur'!B7),\"\")","v":""},{"$f":"IF('spezielle Ladeinfrastruktur'!$B7>\"\",'spezielle Ladeinfrastruktur'!C7,\"\")","v":""},{"$f":"IF('spezielle Ladeinfrastruktur'!$B7>\"\",'spezielle Ladeinfrastruktur'!D7,\"\")","v":""},{"$f":"IF('spezielle Ladeinfrastruktur'!$B7>\"\",'spezielle Ladeinfrastruktur'!E7,\"\")","v":""}]
[{"$f":"IF('spezielle Ladeinfrastruktur'!$B9>\"\",A52+1,A52)","v":0},{"$f":"IF('spezielle Ladeinfrastruktur'!B9>\"\",CONCATENATE(\" LIS \",'spezielle Ladeinfrastruktur'!B9),\"\")","v":""},{"$f":"IF('spezielle Ladeinfrastruktur'!$B9>\"\",'spezielle Ladeinfrastruktur'!C9,\"\")","v":""},{"$f":"IF('spezielle Ladeinfrastruktur'!$B9>\"\",'spezielle Ladeinfrastruktur'!D9,\"\")","v":""},{"$f":"IF('spezielle Ladeinfrastruktur'!$B9>\"\",'spezielle Ladeinfrastruktur'!E9,\"\")","v":""}]
[{"$f":"IF('spezielle Ladeinfrastruktur'!$B11>\"\",A53+1,A53)","v":0},{"$f":"IF('spezielle Ladeinfrastruktur'!B11>\"\",CONCATENATE(\" LIS \",'spezielle Ladeinfrastruktur'!B11),\"\")","v":""},{"$f":"IF('spezielle Ladeinfrastruktur'!$B11>\"\",'spezielle Ladeinfrastruktur'!C11,\"\")","v":""},{"$f":"IF('spezielle Ladeinfrastruktur'!$B11>\"\",'spezielle Ladeinfrastruktur'!D11,\"\")","v":""},{"$f":"IF('spezielle Ladeinfrastruktur'!$B11>\"\",'spezielle Ladeinfrastruktur'!E11,\"\")","v":""}]
[{"$f":"IF('spezielle Ladeinfrastruktur'!$B13>\"\",A54+1,A54)","v":0},{"$f":"IF('spezielle Ladeinfrastruktur'!B13>\"\",CONCATENATE(\" LIS \",'spezielle Ladeinfrastruktur'!B13),\"\")","v":""},{"$f":"IF('spezielle Ladeinfrastruktur'!$B13>\"\",'spezielle Ladeinfrastruktur'!C13,\"\")","v":""},{"$f":"IF('spezielle Ladeinfrastruktur'!$B13>\"\",'spezielle Ladeinfrastruktur'!D13,\"\")","v":""},{"$f":"IF('spezielle Ladeinfrastruktur'!$B13>\"\",'spezielle Ladeinfrastruktur'!E13,\"\")","v":""}]
[{"$f":"IF('spezielle Ladeinfrastruktur'!$B15>\"\",A55+1,A55)","v":0},{"$f":"IF('spezielle Ladeinfrastruktur'!B15>\"\",CONCATENATE(\" LIS \",'spezielle Ladeinfrastruktur'!B15),\"\")","v":""},{"$f":"IF('spezielle Ladeinfrastruktur'!$B15>\"\",'spezielle Ladeinfrastruktur'!C15,\"\")","v":""},{"$f":"IF('spezielle Ladeinfrastruktur'!$B15>\"\",'spezielle Ladeinfrastruktur'!D15,\"\")","v":""},{"$f":"IF('spezielle Ladeinfrastruktur'!$B15>\"\",'spezielle Ladeinfrastruktur'!E15,\"\")","v":""}]
[{"$f":"IF('spezielle Ladeinfrastruktur'!$B17>\"\",A56+1,A56)","v":0},{"$f":"IF('spezielle Ladeinfrastruktur'!B17>\"\",CONCATENATE(\" LIS \",'spezielle Ladeinfrastruktur'!B17),\"\")","v":""},{"$f":"IF('spezielle Ladeinfrastruktur'!$B17>\"\",'spezielle Ladeinfrastruktur'!C17,\"\")","v":""},{"$f":"IF('spezielle Ladeinfrastruktur'!$B17>\"\",'spezielle Ladeinfrastruktur'!D17,\"\")","v":""},{"$f":"IF('spezielle Ladeinfrastruktur'!$B17>\"\",'spezielle Ladeinfrastruktur'!E17,\"\")","v":""}]
[{"$f":"IF('spezielle Ladeinfrastruktur'!$B19>\"\",A57+1,A57)","v":0},{"$f":"IF('spezielle Ladeinfrastruktur'!B19>\"\",CONCATENATE(\" LIS \",'spezielle Ladeinfrastruktur'!B19),\"\")","v":""},{"$f":"IF('spezielle Ladeinfrastruktur'!$B19>\"\",'spezielle Ladeinfrastruktur'!C19,\"\")","v":""},{"$f":"IF('spezielle Ladeinfrastruktur'!$B19>\"\",'spezielle Ladeinfrastruktur'!D19,\"\")","v":""},{"$f":"IF('spezielle Ladeinfrastruktur'!$B19>\"\",'spezielle Ladeinfrastruktur'!E19,\"\")","v":""}]
[{"$f":"IF('spezielle Ladeinfrastruktur'!$B21>\"\",A58+1,A58)","v":0},{"$f":"IF('spezielle Ladeinfrastruktur'!B21>\"\",CONCATENATE(\" LIS \",'spezielle Ladeinfrastruktur'!B21),\"\")","v":""},{"$f":"IF('spezielle Ladeinfrastruktur'!$B21>\"\",'spezielle Ladeinfrastruktur'!C21,\"\")","v":""},{"$f":"IF('spezielle Ladeinfrastruktur'!$B21>\"\",'spezielle Ladeinfrastruktur'!D21,\"\")","v":""},{"$f":"IF('spezielle Ladeinfrastruktur'!$B21>\"\",'spezielle Ladeinfrastruktur'!E21,\"\")","v":""}]
[{"$f":"IF('spezielle Ladeinfrastruktur'!$B23>\"\",A59+1,A59)","v":0},{"$f":"IF('spezielle Ladeinfrastruktur'!B23>\"\",CONCATENATE(\" LIS \",'spezielle Ladeinfrastruktur'!B23),\"\")","v":""},{"$f":"IF('spezielle Ladeinfrastruktur'!$B23>\"\",'spezielle Ladeinfrastruktur'!C23,\"\")","v":""},{"$f":"IF('spezielle Ladeinfrastruktur'!$B23>\"\",'spezielle Ladeinfrastruktur'!D23,\"\")","v":""},{"$f":"IF('spezielle Ladeinfrastruktur'!$B23>\"\",'spezielle Ladeinfrastruktur'!E23,\"\")","v":""}]
[{"$f":"IF('spezielle Ladeinfrastruktur'!$B25>\"\",A60+1,A60)","v":0},{"$f":"IF('spezielle Ladeinfrastruktur'!B25>\"\",CONCATENATE(\" LIS \",'spezielle Ladeinfrastruktur'!B25),\"\")","v":""},{"$f":"IF('spezielle Ladeinfrastruktur'!$B25>\"\",'spezielle Ladeinfrastruktur'!C25,\"\")","v":""},{"$f":"IF('spezielle Ladeinfrastruktur'!$B25>\"\",'spezielle Ladeinfrastruktur'!D25,\"\")","v":""},{"$f":"IF('spezielle Ladeinfrastruktur'!$B25>\"\",'spezielle Ladeinfrastruktur'!E25,\"\")","v":""}]
[null,null,null,"Summe:",{"$f":"ROUND(SUM(E12:E61),0)","v":0}]
[]
[null,null,"Mindestfördersumme erreicht bei FQ ",0.4,{"$f":"IF(Fahrzeuge!$C$6=\"ja\",IF(E$62*D64>8999,\"Ja\",\"Nein\"),IF(E$62*D64>10709,\"Ja\",\"Nein\"))","v":"Nein"}]
[null,null,"Mindestfördersumme erreicht bei FQ ",0.5,{"$f":"IF(Fahrzeuge!$C$6=\"ja\",IF(E$62*D65>8999,\"Ja\",\"Nein\"),IF(E$62*D65>10709,\"Ja\",\"Nein\"))","v":"Nein"}]
[null,null,"Mindestfördersumme erreicht bei FQ ",0.6,{"$f":"IF(Fahrzeuge!$C$6=\"ja\",IF(E$62*D66>8999,\"Ja\",\"Nein\"),IF(E$62*D66>10709,\"Ja\",\"Nein\"))","v":"Nein"}]
[null,null,"Mindestfördersumme erreicht bei FQ ",0.9,{"$f":"IF(Fahrzeuge!$C$6=\"ja\",IF(E$62*D67>8999,\"Ja\",\"Nein\"),IF(E$62*D67>10709,\"Ja\",\"Nein\"))","v":"Nein"}]