{"text_format":"2","workbook":"xlsx","n_sheets":5,"sheets":["Fahrzeuge","LKW, Busse, Sonderfahrzeuge","Ladeinfrastruktur","spezielle Ladeinfrastruktur","Vorlage für AZA"],"not_rendered":{"charts":0,"images":1,"macros":0,"external_links":0,"defined_names":26,"comments":0,"pivot_tables":0},"unopened":[],"bounds":{"document_bytes":16777216,"sheet_cells":100000,"run_cost":"one","rows_first":2000,"rows_last":500,"rows_between":2000,"halvings":0,"cell_chars":16384,"cell_head_chars":4096},"cells_cut":0,"cells_raw":0,"read":"whole","date_system":"1900"}

{"sheet":"Fahrzeuge","index":0,"n_rows":296,"n_cols":23,"rows_kept":296,"cut":false,"hidden":false,"merged":[[0,0,0,1],[5,0,5,7],[6,0,6,7],[9,0,9,7],[8,0,8,7],[7,0,7,7],[4,0,4,7]]}
["Antragsteller ist vorsteuerabzugsberechtigt [Auswahlbox]:",null,null,null,"ja","nein","Stand: 05.07.2018",{"$f":"MATCH(\"Summe\",A:A,0)","v":33},"FKZ"]
[{"$nulls":6},"korrigiert: 11.05.2022",null,"03EMI3"]
["Hinweise:",{"$nulls":5},"ergänzt: 05.10.2022"]
["Mit dieser Tabelle können Sie die förderfähigen Investitionsmehrkosten ermitteln, die in das AZA-Formular in easyOnline eingegeben werden müssen."]
[{"$f":"IF(Fahrzeuge!C1=\"\",\"1.  Wählen Sie zunächst aus, ob Sie zum Vorsteuerabzug berechtigt sind!\",\"\")","v":"1.  Wählen Sie zunächst aus, ob Sie zum Vorsteuerabzug berechtigt sind!"}]
["2. Wählen Sie in der Liste unten die gewünschten Fahrzeuge(Auswahlbox) und die entsprechende Anzahl aus."]
["3. Für Ladeinfrastruktur sowie LKW, Busse und Sonderfahrzeuge wählen Sie bitte die entsprechenden Registerkarten."]
["4. Speichern sie die ausgefüllten Arbeitsblätter (außer 'Vorlage für AZA') als PDF und fügen Sie sie dem Antrag bei."]
["5. Grün unterlegte Felder sind Eingabefelder."]
["Die Registerkarte 'Vorlage für AZA' stellt Ihre Eingaben so dar, wie sie in das easyOnline-Formular eingetragen werden müssen."]
[]
["Pos.","Typ E-Fahrzeug\n[Auswahlbox]","Fahrzeugsegment nach Kraftfahrt-Bundesamt",{"$f":"IF(Fahrzeuge!$C$1=\"nein\",\"Bruttopreis\nE-Fahrzeug\",IF(Fahrzeuge!$C$1=\"ja\",\"Nettopreis\nE-Fahrzeug\",\"Bitte wählen sie aus, ob sie zum Vorsteuerabzug berechtigt sind!\"))","v":"Bitte wählen sie aus, ob sie zum Vorsteuerabzug berechtigt sind!"},"Typ Referenzfahrzeug",{"$f":"IF(Fahrzeuge!$C$1=\"nein\",\"Bruttopreis\nReferenzfahrzeug\",IF(Fahrzeuge!$C$1=\"ja\",\"Nettopreis\nReferenzfahrzeug\",\"Bitte wählen sie aus, ob sie zum Vorsteuerabzug berechtigt sind!\"))","v":"Bitte wählen sie aus, ob sie zum Vorsteuerabzug berechtigt sind!"},{"$f":"IF($C$1=\"nein\",\"Förderfähige Ausgaben pro Fahrzeug (brutto)\",IF($C$1=\"ja\",\"Förderfähige Ausgaben pro Fahrzeug (netto)\",\"Bitte wählen sie aus, ob sie zum Vorsteuerabzug berechtigt sind!\"))","v":"Bitte wählen sie aus, ob sie zum Vorsteuerabzug berechtigt sind!"},"Anzahl zu beschaffender Fahrzeuge des Typs","Förderfähige Ausgaben ","Korrekturfeld PtJ"]
[1,null,{"$f":"IF(B13>0,CONCATENATE(VLOOKUP(B13,L$38:U$296,9,0),\" (\",VLOOKUP(B13,L$38:U$296,10,0),\")\"),\"\")","v":""},{"$f":"IF($B13>0,IF(Fahrzeuge!$C$1=\"nein\",VLOOKUP($B13,$L$37:$S$296,3,0),IF(Fahrzeuge!$C$1=\"ja\",VLOOKUP($B13,$L$37:$S$296,2,0),\"Bitte wählen sie aus, ob sie zum Vorsteuerabzug berechtigt sind!\")),\"\")","v":""},{"$f":"IF($B13>0,VLOOKUP($B13,$L$37:$S$296,4,0),\"\")","v":""},{"$f":"IF($B13>0,IF(Fahrzeuge!$C$1=\"nein\",VLOOKUP($B13,$L$37:$S$296,6,0),IF(Fahrzeuge!$C$1=\"ja\",VLOOKUP($B13,$L$37:$S$296,5,0),\"Bitte wählen sie aus, ob sie zum Vorsteuerabzug berechtigt sind!\")),\"\")","v":""},{"$f":"IF(B13>0,IF($C$1=\"nein\",VLOOKUP($B13,$L$37:$S$296,8,0),IF($C$1=\"ja\",VLOOKUP($B13,$L$37:$S$296,7,0),\"Bitte wählen sie aus, ob sie zum Vorsteuerabzug berechtigt sind!\")),\"\")","v":""},null,{"$f":"IF(B13>0,G13*H13,\"\")","v":""}]
[{"$f":"A13+1","v":2},null,"",{"$f":"IF($B14>0,IF(Fahrzeuge!$C$1=\"nein\",VLOOKUP($B14,$L$37:$S$296,3,0),IF(Fahrzeuge!$C$1=\"ja\",VLOOKUP($B14,$L$37:$S$296,2,0),\"Bitte wählen sie aus, ob sie zum Vorsteuerabzug berechtigt sind!\")),\"\")","v":""},"",{"$f":"IF($B14>0,IF(Fahrzeuge!$C$1=\"nein\",VLOOKUP($B14,$L$37:$S$296,6,0),IF(Fahrzeuge!$C$1=\"ja\",VLOOKUP($B14,$L$37:$S$296,5,0),\"Bitte wählen sie aus, ob sie zum Vorsteuerabzug berechtigt sind!\")),\"\")","v":""},"",null,""]
[{"$f":"A14+1","v":3},null,"",{"$f":"IF($B15>0,IF(Fahrzeuge!$C$1=\"nein\",VLOOKUP($B15,$L$37:$S$296,3,0),IF(Fahrzeuge!$C$1=\"ja\",VLOOKUP($B15,$L$37:$S$296,2,0),\"Bitte wählen sie aus, ob sie zum Vorsteuerabzug berechtigt sind!\")),\"\")","v":""},"",{"$f":"IF($B15>0,IF(Fahrzeuge!$C$1=\"nein\",VLOOKUP($B15,$L$37:$S$296,6,0),IF(Fahrzeuge!$C$1=\"ja\",VLOOKUP($B15,$L$37:$S$296,5,0),\"Bitte wählen sie aus, ob sie zum Vorsteuerabzug berechtigt sind!\")),\"\")","v":""},"",null,""]
[{"$f":"A15+1","v":4},null,"",{"$f":"IF($B16>0,IF(Fahrzeuge!$C$1=\"nein\",VLOOKUP($B16,$L$37:$S$296,3,0),IF(Fahrzeuge!$C$1=\"ja\",VLOOKUP($B16,$L$37:$S$296,2,0),\"Bitte wählen sie aus, ob sie zum Vorsteuerabzug berechtigt sind!\")),\"\")","v":""},"",{"$f":"IF($B16>0,IF(Fahrzeuge!$C$1=\"nein\",VLOOKUP($B16,$L$37:$S$296,6,0),IF(Fahrzeuge!$C$1=\"ja\",VLOOKUP($B16,$L$37:$S$296,5,0),\"Bitte wählen sie aus, ob sie zum Vorsteuerabzug berechtigt sind!\")),\"\")","v":""},"",null,""]
[{"$f":"A16+1","v":5},null,"",{"$f":"IF($B17>0,IF(Fahrzeuge!$C$1=\"nein\",VLOOKUP($B17,$L$37:$S$296,3,0),IF(Fahrzeuge!$C$1=\"ja\",VLOOKUP($B17,$L$37:$S$296,2,0),\"Bitte wählen sie aus, ob sie zum Vorsteuerabzug berechtigt sind!\")),\"\")","v":""},"",{"$f":"IF($B17>0,IF(Fahrzeuge!$C$1=\"nein\",VLOOKUP($B17,$L$37:$S$296,6,0),IF(Fahrzeuge!$C$1=\"ja\",VLOOKUP($B17,$L$37:$S$296,5,0),\"Bitte wählen sie aus, ob sie zum Vorsteuerabzug berechtigt sind!\")),\"\")","v":""},"",null,""]
[{"$f":"A17+1","v":6},null,"",{"$f":"IF($B18>0,IF(Fahrzeuge!$C$1=\"nein\",VLOOKUP($B18,$L$37:$S$296,3,0),IF(Fahrzeuge!$C$1=\"ja\",VLOOKUP($B18,$L$37:$S$296,2,0),\"Bitte wählen sie aus, ob sie zum Vorsteuerabzug berechtigt sind!\")),\"\")","v":""},"",{"$f":"IF($B18>0,IF(Fahrzeuge!$C$1=\"nein\",VLOOKUP($B18,$L$37:$S$296,6,0),IF(Fahrzeuge!$C$1=\"ja\",VLOOKUP($B18,$L$37:$S$296,5,0),\"Bitte wählen sie aus, ob sie zum Vorsteuerabzug berechtigt sind!\")),\"\")","v":""},"",null,""]
[7,null,"",{"$f":"IF($B19>0,IF(Fahrzeuge!$C$1=\"nein\",VLOOKUP($B19,$L$37:$S$296,3,0),IF(Fahrzeuge!$C$1=\"ja\",VLOOKUP($B19,$L$37:$S$296,2,0),\"Bitte wählen sie aus, ob sie zum Vorsteuerabzug berechtigt sind!\")),\"\")","v":""},"",{"$f":"IF($B19>0,IF(Fahrzeuge!$C$1=\"nein\",VLOOKUP($B19,$L$37:$S$296,6,0),IF(Fahrzeuge!$C$1=\"ja\",VLOOKUP($B19,$L$37:$S$296,5,0),\"Bitte wählen sie aus, ob sie zum Vorsteuerabzug berechtigt sind!\")),\"\")","v":""},"",null,""]
[8,null,"",{"$f":"IF($B20>0,IF(Fahrzeuge!$C$1=\"nein\",VLOOKUP($B20,$L$37:$S$296,3,0),IF(Fahrzeuge!$C$1=\"ja\",VLOOKUP($B20,$L$37:$S$296,2,0),\"Bitte wählen sie aus, ob sie zum Vorsteuerabzug berechtigt sind!\")),\"\")","v":""},"",{"$f":"IF($B20>0,IF(Fahrzeuge!$C$1=\"nein\",VLOOKUP($B20,$L$37:$S$296,6,0),IF(Fahrzeuge!$C$1=\"ja\",VLOOKUP($B20,$L$37:$S$296,5,0),\"Bitte wählen sie aus, ob sie zum Vorsteuerabzug berechtigt sind!\")),\"\")","v":""},"",null,""]
{"$rows_left_out":277}
{"sheet":"LKW, Busse, Sonderfahrzeuge","index":1,"n_rows":26,"n_cols":9,"rows_kept":26,"cut":false,"hidden":false,"merged":[[1,0,1,7],[2,0,2,7],[0,0,0,7]]}
["Ermittlung der förderfähigen Ausgaben für LKW, Busse und Sonder-Fahrzeuge",{"$nulls":7},"FKZ:"]
["Hierfür müssen Sie entsprechende Angebote für das E-Fahrzeug und ein Referenzfahrzeug eingeholt haben. Diese Angebote sind beizufügen.",{"$nulls":7},{"$f":"Fahrzeuge!I2","v":"03EMI3"}]
[{"$f":"IF(Fahrzeuge!C1=\"\",\"Bitte geben Sie auf der Registerkarte 'Fahrzeuge'  an, ob Sie zum Vorsteuerabzug berechtigt sind\",\"\")","v":"Bitte geben Sie auf der Registerkarte 'Fahrzeuge'  an, ob Sie zum Vorsteuerabzug berechtigt sind"}]
[]
["Pos.","Typ E-Fahrzeug",{"$f":"IF(Fahrzeuge!$C$1=\"nein\",\"Bruttopreis\nE-Fahrzeug laut beigefügtem Angebot *\",IF(Fahrzeuge!$C$1=\"ja\",\"Nettopreis\nE-Fahrzeug laut beigefügtem Angebot *\",\"Bitte wählen sie aus, ob sie zum Vorsteuerabzug berechtigt sind!\"))","v":"Bitte wählen sie aus, ob sie zum Vorsteuerabzug berechtigt sind!"},"Typ Referenzfahrzeug",{"$f":"IF(Fahrzeuge!$C$1=\"nein\",\"Bruttopreis Referenzfahrzeug\nlaut beigefügtem Angebot *\",IF(Fahrzeuge!$C$1=\"ja\",\"Nettopreis Referenzfahrzeug\nlaut beigefügtem Angebot *\",\"Bitte wählen sie aus, ob sie zum Vorsteuerabzug berechtigt sind!\"))","v":"Bitte wählen sie aus, ob sie zum Vorsteuerabzug berechtigt sind!"},{"$f":"IF(Fahrzeuge!$C$1=\"nein\",\"Förderfähige Ausgaben pro Fahrzeug (brutto)\",IF(Fahrzeuge!$C$1=\"ja\",\"Förderfähige Ausgaben pro Fahrzeug (netto)\",\"Bitte wählen sie aus, ob sie zum Vorsteuerabzug berechtigt sind!\"))","v":"Bitte wählen sie aus, ob sie zum Vorsteuerabzug berechtigt sind!"},"Anzahl zu beschaffender Fahrzeuge des Typs","Förderfähige Ausgaben ","Korrekturfeld PtJ"]
[1,{"$nulls":4},{"$f":"IF(B6>\"\",IF($A$3=\"\",C6-E6,$F$5),\"\")","v":""},null,{"$f":"IF(B6>\"\",F6*G6,\"\")","v":""}]
[]
[2,{"$nulls":4},{"$f":"IF(B8>\"\",IF($A$3=\"\",C8-E8,$F$5),\"\")","v":""},null,{"$f":"IF(B8>\"\",F8*G8,\"\")","v":""}]
[]
[3,{"$nulls":4},"",null,""]
[]
[4,{"$nulls":4},"",null,""]
[]
[5,{"$nulls":4},"",null,""]
[]
[6,{"$nulls":4},"",null,""]
[]
[7,{"$nulls":4},"",null,""]
[]
[8,{"$nulls":4},"",null,""]
{"$rows_left_out":7}
{"sheet":"Ladeinfrastruktur","index":2,"n_rows":30,"n_cols":11,"rows_kept":30,"cut":false,"hidden":false,"merged":[[1,0,1,5],[26,1,26,5]]}
["Ermittlung der förderfähigen Pauschalen für Ladeinfrastruktur",null,null,null,"FKZ:",{"$f":"Fahrzeuge!I2","v":"03EMI3"}]
[{"$f":"IF(Fahrzeuge!C1=\"\",\"Bitte geben Sie auf der Registerkarte 'Fahrzeuge'  an, ob Sie zum Vorsteuerabzug berechtigt sind\",\"\")","v":"Bitte geben Sie auf der Registerkarte 'Fahrzeuge'  an, ob Sie zum Vorsteuerabzug berechtigt sind"}]
[]
["Pos.","Typ Ladeinfrastruktur (LIS)*\n[Auswahlbox]",{"$f":"IF(Fahrzeuge!$C$1=\"nein\",\"Förderfähige Ausgaben pro Ladesäule (brutto)\",IF(Fahrzeuge!$C$1=\"ja\",\"Förderfähige Ausgaben pro Ladesäule (netto)\",\"Bitte wählen sie aus, ob sie zum Vorsteuerabzug berechtigt sind!\"))","v":"Bitte wählen sie aus, ob sie zum Vorsteuerabzug berechtigt sind!"},"Anzahl zu beschaffender Ladesäulen des Typs","Förderfähige Ausgaben ","Korrekturfeld PtJ",null,null,"Typ Ladeinfrastruktur","Ausgabenpauschale netto","Ausgabenpauschale netto"]
[1,null,{"$f":"IF($B5>0,IF(Fahrzeuge!$C$1=\"nein\",VLOOKUP($B5,$I$5:$K$14,3,0),IF(Fahrzeuge!$C$1=\"ja\",VLOOKUP($B5,$I$5:$K$14,2,0),\"Bitte wählen sie aus, ob sie zum Vorsteuerabzug berechtigt sind!\")),\"\")","v":""},null,{"$f":"IF(D5>0,C5*D5,\"\")","v":""},null,null,null,"öff. zugängl. [AC] ≥ 3,7 kW (1 Ladepunkt)",2000,{"$f":"J5*1.19","v":2380}]
[{"$nulls":8},"öff. zugängl. [AC] ≥ 11 kW (min. 2 Ladepunkte)",5000,{"$f":"J6*1.19","v":5950}]
[2,null,{"$f":"IF($B7>0,IF(Fahrzeuge!$C$1=\"nein\",VLOOKUP($B7,$I$5:$K$14,3,0),IF(Fahrzeuge!$C$1=\"ja\",VLOOKUP($B7,$I$5:$K$14,2,0),\"Bitte wählen sie aus, ob sie zum Vorsteuerabzug berechtigt sind!\")),\"\")","v":""},null,{"$f":"IF(D7>0,C7*D7,\"\")","v":""},null,null,null,"öff. zugängl. [DC] ≤ 50 kW",20000,23800]
[{"$nulls":8},"öff. zugängl. [DC] 51 kW-149 kW",35000,41650]
[3,null,{"$f":"IF($B9>0,IF(Fahrzeuge!$C$1=\"nein\",VLOOKUP($B9,$I$5:$K$14,3,0),IF(Fahrzeuge!$C$1=\"ja\",VLOOKUP($B9,$I$5:$K$14,2,0),\"Bitte wählen sie aus, ob sie zum Vorsteuerabzug berechtigt sind!\")),\"\")","v":""},null,{"$f":"IF(D9>0,C9*D9,\"\")","v":""},null,null,null,"öff. zugängl. [DC] ≥ 150 kW",50000,59500]
[{"$nulls":8},"nicht öff. zugängl. [AC] ≥ 3,7 kW (1 Ladepunkt)",900,1071]
[4,null,{"$f":"IF($B11>0,IF(Fahrzeuge!$C$1=\"nein\",VLOOKUP($B11,$I$5:$K$14,3,0),IF(Fahrzeuge!$C$1=\"ja\",VLOOKUP($B11,$I$5:$K$14,2,0),\"Bitte wählen sie aus, ob sie zum Vorsteuerabzug berechtigt sind!\")),\"\")","v":""},null,{"$f":"IF(D11>0,C11*D11,\"\")","v":""},null,null,null,"nicht öff. zugängl. [AC] ≥ 11 kW (min. 2 Ladepunkte)",3000,3570]
[{"$nulls":8},"nicht öff. zugängl. [DC] ≤ 50 kW",20000,23800]
[5,null,{"$f":"IF($B13>0,IF(Fahrzeuge!$C$1=\"nein\",VLOOKUP($B13,$I$5:$K$14,3,0),IF(Fahrzeuge!$C$1=\"ja\",VLOOKUP($B13,$I$5:$K$14,2,0),\"Bitte wählen sie aus, ob sie zum Vorsteuerabzug berechtigt sind!\")),\"\")","v":""},null,{"$f":"IF(D13>0,C13*D13,\"\")","v":""},null,null,null,"nicht öff. zugängl. [DC] 51 kW-149 kW",35000,41650]
[{"$nulls":8},"nicht öff. zugängl. [DC] ≥ 150 kW",50000,59500]
[6,null,{"$f":"IF($B15>0,IF(Fahrzeuge!$C$1=\"nein\",VLOOKUP($B15,$I$5:$K$14,3,0),IF(Fahrzeuge!$C$1=\"ja\",VLOOKUP($B15,$I$5:$K$14,2,0),\"Bitte wählen sie aus, ob sie zum Vorsteuerabzug berechtigt sind!\")),\"\")","v":""},null,{"$f":"IF(D15>0,C15*D15,\"\")","v":""}]
[]
[7,null,{"$f":"IF($B17>0,IF(Fahrzeuge!$C$1=\"nein\",VLOOKUP($B17,$I$5:$K$14,3,0),IF(Fahrzeuge!$C$1=\"ja\",VLOOKUP($B17,$I$5:$K$14,2,0),\"Bitte wählen sie aus, ob sie zum Vorsteuerabzug berechtigt sind!\")),\"\")","v":""},null,{"$f":"IF(D17>0,C17*D17,\"\")","v":""}]
[]
[8,null,{"$f":"IF($B19>0,IF(Fahrzeuge!$C$1=\"nein\",VLOOKUP($B19,$I$5:$K$14,3,0),IF(Fahrzeuge!$C$1=\"ja\",VLOOKUP($B19,$I$5:$K$14,2,0),\"Bitte wählen sie aus, ob sie zum Vorsteuerabzug berechtigt sind!\")),\"\")","v":""},null,{"$f":"IF(D19>0,C19*D19,\"\")","v":""}]
[]
{"$rows_left_out":11}
{"sheet":"spezielle Ladeinfrastruktur","index":3,"n_rows":26,"n_cols":7,"rows_kept":26,"cut":false,"hidden":false,"merged":[[26,0,26,5],[1,0,1,6],[0,0,0,3]]}
["Ermittlung der förderfähigen Ausgaben für Ladeinfrastruktur die nicht in der Registerkarte \"Ladeinfrastruktur\" aufgeführt wird",{"$nulls":4},"FKZ:",{"$f":"Fahrzeuge!I2","v":"03EMI3"}]
["Hierfür müssen Sie entsprechende Angebote für die Ladeinfrastruktur eingeholt haben. Diese Angebote sind beizufügen."]
[{"$f":"IF(Fahrzeuge!C1=\"\",\"Bitte geben Sie auf der Registerkarte 'Fahrzeuge'  an, ob Sie zum Vorsteuerabzug berechtigt sind\",\"\")","v":"Bitte geben Sie auf der Registerkarte 'Fahrzeuge'  an, ob Sie zum Vorsteuerabzug berechtigt sind"}]
[]
["Pos.","Typ Ladeinfrastruktur (LIS)",{"$f":"IF(Fahrzeuge!$C$1=\"nein\",\"Bruttopreis LIS laut beigefügtem Angebot *\",IF(Fahrzeuge!$C$1=\"ja\",\"Nettopreis LIS laut beigefügtem Angebot *\",\"Bitte wählen sie aus, ob sie zum Vorsteuerabzug berechtigt sind!\"))","v":"Bitte wählen sie aus, ob sie zum Vorsteuerabzug berechtigt sind!"},"Anzahl zu beschaffender LIS dieses Typs","Förderfähige Ausgaben ","Korrekturfeld PtJ"]
[1,null,null,null,{"$f":"IF(C6>0,D6*C6,\"\")","v":""}]
[]
[2,null,null,null,{"$f":"IF(C8>0,D8*C8,\"\")","v":""}]
[]
[3,null,null,null,{"$f":"IF(C10>0,D10*C10,\"\")","v":""}]
[]
[4,null,null,null,{"$f":"IF(C12>0,D12*C12,\"\")","v":""}]
[]
[5,null,null,null,{"$f":"IF(C14>0,D14*C14,\"\")","v":""}]
[]
[6,null,null,null,{"$f":"IF(C16>0,D16*C16,\"\")","v":""}]
[]
[7,null,null,null,{"$f":"IF(C18>0,D18*C18,\"\")","v":""}]
[]
[8,null,null,null,{"$f":"IF(C20>0,D20*C20,\"\")","v":""}]
{"$rows_left_out":7}
{"sheet":"Vorlage für AZA","index":4,"n_rows":59,"n_cols":5,"rows_kept":59,"cut":false,"hidden":false,"merged":[[0,0,0,7],[2,0,2,7],[4,0,4,7],[5,0,5,7]]}
["Vorlage zum Übertragen der Daten aus dieser Tabelle in den AZA in easyOnline, die Anzahl der zu beschaffenden Fzg. / LIS muss ggf. auf die Anschaffungsjahre aufgeteilt werden"]
[]
["Gesamtfinanzierung - Gegenstände und andere Investitionen von mehr als 410 € im Einzelfall"]
[null,null,null,"FKZ:",{"$f":"Fahrzeuge!I2","v":"03EMI3"}]
[{"$f":"IF(Fahrzeuge!$C$1=\"nein\",\"Der Antragsteller ist nicht zum Vorsteuerabzug berechtigt.\",IF(Fahrzeuge!$C$1=\"ja\",\"Der Antragsteller ist zum Vorsteuerabzug berechtigt.\",\"Bitte wählen sie aus, ob sie zum Vorsteuerabzug berechtigt sind!\"))","v":"Bitte wählen sie aus, ob sie zum Vorsteuerabzug berechtigt sind!"}]
["(sollte diese Aussage nicht zutreffen, wählen Sie bitte die entsprechende Option auf der Registerkarte \"Fahrzeuge\")"]
[]
["lfd. Nr.","Bezeichnung","Zuwendungsfähige\nAusgaben / Stück*","Anzahl*","F0833 Betrag €"]
[{"$f":"IF(Fahrzeuge!$B13>\"\",Fahrzeuge!A13,0)","v":0},{"$f":"IF(Fahrzeuge!$B13>\"\",CONCATENATE(Fahrzeuge!C13,\" \",Fahrzeuge!B13),\"\")","v":""},{"$f":"IF(Fahrzeuge!$B13>\"\",Fahrzeuge!G13,\"\")","v":""},{"$f":"IF(Fahrzeuge!$B13>\"\",Fahrzeuge!H13,\"\")","v":""},{"$f":"IF(Fahrzeuge!$B13>\"\",Fahrzeuge!I13,\"\")","v":""}]
[{"$f":"IF(Fahrzeuge!$B14>\"\",Fahrzeuge!A14,0)","v":0},{"$f":"IF(Fahrzeuge!$B14>\"\",CONCATENATE(Fahrzeuge!C14,\" \",Fahrzeuge!B14),\"\")","v":""},{"$f":"IF(Fahrzeuge!$B14>\"\",Fahrzeuge!G14,\"\")","v":""},{"$f":"IF(Fahrzeuge!$B14>\"\",Fahrzeuge!H14,\"\")","v":""},{"$f":"IF(Fahrzeuge!$B14>\"\",Fahrzeuge!I14,\"\")","v":""}]
[{"$f":"IF(Fahrzeuge!$B15>\"\",Fahrzeuge!A15,0)","v":0},{"$f":"IF(Fahrzeuge!$B15>\"\",CONCATENATE(Fahrzeuge!C15,\" \",Fahrzeuge!B15),\"\")","v":""},{"$f":"IF(Fahrzeuge!$B15>\"\",Fahrzeuge!G15,\"\")","v":""},{"$f":"IF(Fahrzeuge!$B15>\"\",Fahrzeuge!H15,\"\")","v":""},{"$f":"IF(Fahrzeuge!$B15>\"\",Fahrzeuge!I15,\"\")","v":""}]
[{"$f":"IF(Fahrzeuge!$B16>\"\",Fahrzeuge!A16,0)","v":0},{"$f":"IF(Fahrzeuge!$B16>\"\",CONCATENATE(Fahrzeuge!C16,\" \",Fahrzeuge!B16),\"\")","v":""},{"$f":"IF(Fahrzeuge!$B16>\"\",Fahrzeuge!G16,\"\")","v":""},{"$f":"IF(Fahrzeuge!$B16>\"\",Fahrzeuge!H16,\"\")","v":""},{"$f":"IF(Fahrzeuge!$B16>\"\",Fahrzeuge!I16,\"\")","v":""}]
[{"$f":"IF(Fahrzeuge!$B17>\"\",Fahrzeuge!A17,0)","v":0},{"$f":"IF(Fahrzeuge!$B17>\"\",CONCATENATE(Fahrzeuge!C17,\" \",Fahrzeuge!B17),\"\")","v":""},{"$f":"IF(Fahrzeuge!$B17>\"\",Fahrzeuge!G17,\"\")","v":""},{"$f":"IF(Fahrzeuge!$B17>\"\",Fahrzeuge!H17,\"\")","v":""},{"$f":"IF(Fahrzeuge!$B17>\"\",Fahrzeuge!I17,\"\")","v":""}]
[{"$f":"IF(Fahrzeuge!$B18>\"\",Fahrzeuge!A18,0)","v":0},{"$f":"IF(Fahrzeuge!$B18>\"\",CONCATENATE(Fahrzeuge!C18,\" \",Fahrzeuge!B18),\"\")","v":""},{"$f":"IF(Fahrzeuge!$B18>\"\",Fahrzeuge!G18,\"\")","v":""},{"$f":"IF(Fahrzeuge!$B18>\"\",Fahrzeuge!H18,\"\")","v":""},{"$f":"IF(Fahrzeuge!$B18>\"\",Fahrzeuge!I18,\"\")","v":""}]
[{"$f":"IF(Fahrzeuge!$B19>\"\",Fahrzeuge!A19,0)","v":0},{"$f":"IF(Fahrzeuge!$B19>\"\",CONCATENATE(Fahrzeuge!C19,\" \",Fahrzeuge!B19),\"\")","v":""},{"$f":"IF(Fahrzeuge!$B19>\"\",Fahrzeuge!G19,\"\")","v":""},{"$f":"IF(Fahrzeuge!$B19>\"\",Fahrzeuge!H19,\"\")","v":""},{"$f":"IF(Fahrzeuge!$B19>\"\",Fahrzeuge!I19,\"\")","v":""}]
[{"$f":"IF(Fahrzeuge!$B20>\"\",Fahrzeuge!A20,0)","v":0},{"$f":"IF(Fahrzeuge!$B20>\"\",CONCATENATE(Fahrzeuge!C20,\" \",Fahrzeuge!B20),\"\")","v":""},{"$f":"IF(Fahrzeuge!$B20>\"\",Fahrzeuge!G20,\"\")","v":""},{"$f":"IF(Fahrzeuge!$B20>\"\",Fahrzeuge!H20,\"\")","v":""},{"$f":"IF(Fahrzeuge!$B20>\"\",Fahrzeuge!I20,\"\")","v":""}]
[{"$f":"IF(Fahrzeuge!$B21>\"\",Fahrzeuge!A21,0)","v":0},{"$f":"IF(Fahrzeuge!$B21>\"\",CONCATENATE(Fahrzeuge!C21,\" \",Fahrzeuge!B21),\"\")","v":""},{"$f":"IF(Fahrzeuge!$B21>\"\",Fahrzeuge!G21,\"\")","v":""},{"$f":"IF(Fahrzeuge!$B21>\"\",Fahrzeuge!H21,\"\")","v":""},{"$f":"IF(Fahrzeuge!$B21>\"\",Fahrzeuge!I21,\"\")","v":""}]
[{"$f":"IF(Fahrzeuge!$B22>\"\",Fahrzeuge!A22,0)","v":0},{"$f":"IF(Fahrzeuge!$B22>\"\",CONCATENATE(Fahrzeuge!C22,\" \",Fahrzeuge!B22),\"\")","v":""},{"$f":"IF(Fahrzeuge!$B22>\"\",Fahrzeuge!G22,\"\")","v":""},{"$f":"IF(Fahrzeuge!$B22>\"\",Fahrzeuge!H22,\"\")","v":""},{"$f":"IF(Fahrzeuge!$B22>\"\",Fahrzeuge!I22,\"\")","v":""}]
[{"$f":"IF(Fahrzeuge!$B23>\"\",Fahrzeuge!A23,0)","v":0},{"$f":"IF(Fahrzeuge!$B23>\"\",CONCATENATE(Fahrzeuge!C23,\" \",Fahrzeuge!B23),\"\")","v":""},{"$f":"IF(Fahrzeuge!$B23>\"\",Fahrzeuge!G23,\"\")","v":""},{"$f":"IF(Fahrzeuge!$B23>\"\",Fahrzeuge!H23,\"\")","v":""},{"$f":"IF(Fahrzeuge!$B23>\"\",Fahrzeuge!I23,\"\")","v":""}]
[{"$f":"IF(Fahrzeuge!$B24>\"\",Fahrzeuge!A24,0)","v":0},{"$f":"IF(Fahrzeuge!$B24>\"\",CONCATENATE(Fahrzeuge!C24,\" \",Fahrzeuge!B24),\"\")","v":""},{"$f":"IF(Fahrzeuge!$B24>\"\",Fahrzeuge!G24,\"\")","v":""},{"$f":"IF(Fahrzeuge!$B24>\"\",Fahrzeuge!H24,\"\")","v":""},{"$f":"IF(Fahrzeuge!$B24>\"\",Fahrzeuge!I24,\"\")","v":""}]
{"$rows_left_out":39}