{"text_format":"2","workbook":"xlsx","n_sheets":6,"sheets":["Auswertung_Segmente","Fahrzeuge","LKW, Busse, Sonderfahrzeuge","Ladeinfrastruktur","spezielle Ladeinfrastruktur","Vorlage für AZA"],"not_rendered":{"charts":0,"images":1,"macros":0,"external_links":0,"defined_names":28,"comments":0,"pivot_tables":1},"unopened":[],"bounds":{"document_bytes":16777216,"sheet_cells":100000,"run_cost":"one","rows_first":2000,"rows_last":500,"rows_between":2000,"halvings":0,"cell_chars":16384,"cell_head_chars":4096},"cells_cut":0,"cells_raw":0,"read":"whole","date_system":"1900"}

{"sheet":"Auswertung_Segmente","index":0,"n_rows":99,"n_cols":9,"rows_kept":99,"cut":false,"hidden":true,"merged":[]}
[]
[]
["Maximum von förderfähig brutto",{"$nulls":5},"Maximum von förderfähig brutto"]
["Info Segment","E-Fahrzeug","Ergebnis",null,null,null,"Info Segment","E-Fahrzeug","Ergebnis"]
["Kleinwagen","BMW i3 (120Ah)",8500,null,null,null,"Kleinwagen","Renault Zoe Life (41 kWh)",18610]
[null,"BMW i3s (120Ah)",7250,null,null,null,"Kompaktklasse","Opel Ampera-E Plus",18375]
[null,"Mercedes Benz smart forfour electric drive (alle Versionen)",10775,null,null,null,"Mini","Volkswagen e-load up",12845]
[null,"Renault Zoe Life (22 kWh)",14410,null,null,null,"Mittelklasse","Kia Optima 2.0 GDI Plug-in Hybrid (Sportswagon)",12050]
[null,"Renault Zoe Life (22 kWh), Batterie zur Miete",6410,null,null,null,"Obere Mittelklasse","Volvo V90 T8 TWIN ENGINE AWD",12700]
[null,"Renault Zoe Life (41 kWh)",18610,null,null,null,"Utility (N1)","Volkswagen e-Crafter",48338]
[null,"Renault Zoe Life (41 kWh), Batterie zur Miete",10610,null,null,null,"Geländewagen / SUV","Jaguar I-Pace",21490]
["Kleinwagen Ergebnis",null,18610,null,null,null,"Oberklasse","Tesla Model S Maximal-Reichweite",18080]
["Kompaktklasse","BMW 225xe iPerformance Active Tourer"]
[null,"Hyundai IONIQ Elektro",10650]
[null,"Hyundai IONIQ Plug-in-Hybrid",7250]
[null,"Kia e-Niro 39,2 kWh",11200]
[null,"Kia e-Niro 64 kWh",15000]
[null,"Kia Niro Plug-in Hybrid",9660]
[null,"Nissan Leaf ZE1 (40 kwh)",18310]
[null,"Opel Ampera-E Plus",18375]
{"$rows_left_out":80}
{"sheet":"Fahrzeuge","index":1,"n_rows":262,"n_cols":55,"rows_kept":262,"cut":false,"hidden":false,"merged":[[0,0,0,1],[5,0,5,11],[6,0,6,11],[9,0,9,11],[8,0,8,11],[7,0,7,11],[4,0,4,11]]}
["Antragsteller ist vorsteuerabzugsberechtigt [Auswahlbox]:",{"$nulls":4},"ja","nein","Stand: 09.09.2021",null,null,null,"FKZ"]
[{"$nulls":7},"korrigiert: 23.06.2021",null,null,null,"03EMIS1"]
["Hinweise:",{"$nulls":6},"ergänzt: 01.03.2022"]
["Mit dieser Tabelle können Sie die förderfähigen Ausgaben ermitteln, die in das AZA-Formular in easyOnline eingegeben werden müssen."]
[{"$f":"IF(Fahrzeuge!C1=\"\",\"1.  Wählen Sie zunächst aus, ob Sie zum Vorsteuerabzug berechtigt sind!\",\"\")","v":"1.  Wählen Sie zunächst aus, ob Sie zum Vorsteuerabzug berechtigt sind!"}]
["2.  Wählen Sie in der Liste unten die gewünschten Fahrzeuge(Auswahlbox) und die entsprechende Anzahl aus. Geben sie die zu erwartende durchschnittliche Jahresfahrleistung für jedes Modell ein (bei PHEV automatisch gedeckelt)"]
["3.  Für Ladeinfrastruktur sowie LKW, Busse und Sonderfahrzeuge wählen Sie bitte die entsprechenden Registerkarten."]
["4.  Speichern sie die ausgefüllten Arbeitsblätter (außer 'Vorlage für AZA') als PDF und fügen Sie sie dem Antrag bei."]
["5.  Grün unterlegte Felder sind Eingabefelder."]
["Die Registerkarte 'Vorlage für AZA' stellt Ihre Eingaben so dar, wie sie in das easyOnline-Formular eingetragen werden müssen."]
[]
["Pos.","Typ E-Fahrzeug\n[Auswahlbox]","Fahrzeugsegment nach Kraftfahrt-Bundesamt",{"$f":"IF(Fahrzeuge!$C$1=\"nein\",\"Bruttopreis\nE-Fahrzeug\",IF(Fahrzeuge!$C$1=\"ja\",\"Nettopreis\nE-Fahrzeug\",\"Bitte wählen sie aus, ob sie zum Vorsteuerabzug berechtigt sind!\"))","v":"Bitte wählen sie aus, ob sie zum Vorsteuerabzug berechtigt sind!"},"Typ Referenzfahrzeug",{"$f":"IF(Fahrzeuge!$C$1=\"nein\",\"Bruttopreis\nReferenzfahrzeug\",IF(Fahrzeuge!$C$1=\"ja\",\"Nettopreis\nReferenzfahrzeug\",\"Bitte wählen sie aus, ob sie zum Vorsteuerabzug berechtigt sind!\"))","v":"Bitte wählen sie aus, ob sie zum Vorsteuerabzug berechtigt sind!"},{"$f":"IF($C$1=\"nein\",\"Förderfähige Ausgaben pro Fahrzeug (brutto)\",IF($C$1=\"ja\",\"Förderfähige Ausgaben pro Fahrzeug (netto)\",\"Bitte wählen sie aus, ob sie zum Vorsteuerabzug berechtigt sind!\"))","v":"Bitte wählen sie aus, ob sie zum Vorsteuerabzug berechtigt sind!"},"Anzahl zu beschaffender Fahrzeuge des Typs","erwartete durchschnittliche Jahres- Fahrleistung in km","anerkannte durchschnittliche elektrische Jahres-Fahrleistung in km","Förderfähige Ausgaben ","Korrekturfeld PtJ",{"$nulls":30},"Kommentar","E-Fahrzeug","PHEV","E-Listenpreis netto","E-Listenpreis brutto","Vergleichsfahrzeug","Listenpreis netto","Listenpreis brutto","förderfähig netto","förderfähig brutto","Info Segment","Fahrzeugklasse Abkürzung","ergänzt am:"]
[1,null,{"$f":"IF(B13>0,CONCATENATE(VLOOKUP(B13,N$37:X$262,10,0),\" (\",VLOOKUP(B13,N$37:X$262,11,0),\")\"),\"\")","v":""},{"$f":"IF($B13>0,IF(Fahrzeuge!$C$1=\"nein\",VLOOKUP($B13,$N$37:$V$262,4,0),IF(Fahrzeuge!$C$1=\"ja\",VLOOKUP($B13,$N$37:$V$262,3,0),\"Bitte wählen sie aus, ob sie zum Vorsteuerabzug berechtigt sind!\")),\"\")","v":""},{"$f":"IF($B13>0,VLOOKUP($B13,$N$37:$V$262,5,0),\"\")","v":""},{"$f":"IF($B13>0,IF(Fahrzeuge!$C$1=\"nein\",VLOOKUP($B13,$N$37:$V$262,7,0),IF(Fahrzeuge!$C$1=\"ja\",VLOOKUP($B13,$N$37:$V$262,6,0),\"Bitte wählen sie aus, ob sie zum Vorsteuerabzug berechtigt sind!\")),\"\")","v":""},{"$f":"IF(B13>0,IF($C$1=\"nein\",VLOOKUP($B13,$N$37:$V$262,9,0),IF($C$1=\"ja\",VLOOKUP($B13,$N$37:$V$262,8,0),\"Bitte wählen sie aus, ob sie zum Vorsteuerabzug berechtigt sind!\")),\"\")","v":""},null,null,{"$f":"IF($B13>0,IF(VLOOKUP($B13,$N$37:$V$262,2,FALSE)=\"x\",IF(I13>10000,10000,I13),I13),\"\")","v":""},{"$f":"IF(B13>0,G13*H13,\"\")","v":""},{"$nulls":32},"Aixam eCity",null,{"$f":"ROUND(AU13/1.19,2)","v":12092.44},14390,"Mercedes Benz smart 52 kW",{"$f":"ROUND(AX13/1.19,2)","v":9382.35},11165,{"$f":"ROUND(AT13-AW13,0)","v":2710},{"$f":"ROUND(AU13-AX13,0)","v":3225},"Leichtfahrzeug","LFZ",43913]
[{"$f":"A13+1","v":2},null,"",{"$f":"IF($B14>0,IF(Fahrzeuge!$C$1=\"nein\",VLOOKUP($B14,$N$37:$V$262,4,0),IF(Fahrzeuge!$C$1=\"ja\",VLOOKUP($B14,$N$37:$V$262,3,0),\"Bitte wählen sie aus, ob sie zum Vorsteuerabzug berechtigt sind!\")),\"\")","v":""},"",{"$f":"IF($B14>0,IF(Fahrzeuge!$C$1=\"nein\",VLOOKUP($B14,$N$37:$V$262,7,0),IF(Fahrzeuge!$C$1=\"ja\",VLOOKUP($B14,$N$37:$V$262,6,0),\"Bitte wählen sie aus, ob sie zum Vorsteuerabzug berechtigt sind!\")),\"\")","v":""},"",null,null,"","",{"$nulls":32},"Audi A3 e-tron",null,{"$f":"ROUND(AU14/1.19,2)","v":31848.74},37900,"Audi A3 Sportback Attraction",23949.58,28500,7899,9400,"Kompaktklasse","PKW"]
[{"$f":"A14+1","v":3},null,"",{"$f":"IF($B15>0,IF(Fahrzeuge!$C$1=\"nein\",VLOOKUP($B15,$N$37:$V$262,4,0),IF(Fahrzeuge!$C$1=\"ja\",VLOOKUP($B15,$N$37:$V$262,3,0),\"Bitte wählen sie aus, ob sie zum Vorsteuerabzug berechtigt sind!\")),\"\")","v":""},"",{"$f":"IF($B15>0,IF(Fahrzeuge!$C$1=\"nein\",VLOOKUP($B15,$N$37:$V$262,7,0),IF(Fahrzeuge!$C$1=\"ja\",VLOOKUP($B15,$N$37:$V$262,6,0),\"Bitte wählen sie aus, ob sie zum Vorsteuerabzug berechtigt sind!\")),\"\")","v":""},"",null,null,"","",{"$nulls":32},"Audi e-tron 50 Quattro",null,{"$f":"ROUND(AU15/1.19,2)","v":58067.23},69100,"Audi A6 allroad quattro 3.0 TDI 200kW",51302.52,61050,6765,8050,"Geländewagen / SUV","PKW",43913]
[{"$f":"A15+1","v":4},null,"",{"$f":"IF($B16>0,IF(Fahrzeuge!$C$1=\"nein\",VLOOKUP($B16,$N$37:$V$262,4,0),IF(Fahrzeuge!$C$1=\"ja\",VLOOKUP($B16,$N$37:$V$262,3,0),\"Bitte wählen sie aus, ob sie zum Vorsteuerabzug berechtigt sind!\")),\"\")","v":""},"",{"$f":"IF($B16>0,IF(Fahrzeuge!$C$1=\"nein\",VLOOKUP($B16,$N$37:$V$262,7,0),IF(Fahrzeuge!$C$1=\"ja\",VLOOKUP($B16,$N$37:$V$262,6,0),\"Bitte wählen sie aus, ob sie zum Vorsteuerabzug berechtigt sind!\")),\"\")","v":""},"",null,null,"","",{"$nulls":32},"Audi e-tron 55 Quattro",null,{"$f":"ROUND(AU16/1.19,2)","v":67142.86},79900,"Audi A6 allroad quattro 3.0 TDI 200kW",51302.52,61050,15840,18850,"Geländewagen / SUV","PKW"]
[{"$f":"A16+1","v":5},null,"",{"$f":"IF($B17>0,IF(Fahrzeuge!$C$1=\"nein\",VLOOKUP($B17,$N$37:$V$262,4,0),IF(Fahrzeuge!$C$1=\"ja\",VLOOKUP($B17,$N$37:$V$262,3,0),\"Bitte wählen sie aus, ob sie zum Vorsteuerabzug berechtigt sind!\")),\"\")","v":""},"",{"$f":"IF($B17>0,IF(Fahrzeuge!$C$1=\"nein\",VLOOKUP($B17,$N$37:$V$262,7,0),IF(Fahrzeuge!$C$1=\"ja\",VLOOKUP($B17,$N$37:$V$262,6,0),\"Bitte wählen sie aus, ob sie zum Vorsteuerabzug berechtigt sind!\")),\"\")","v":""},"",null,null,"","",{"$nulls":32},"Audi Q5 TFSI e quattro","x",70101.679999999993,79753.36,"Audi Q5 sport 45 TFSI quattro",45378.15,54000,24724,25753,"Geländewagen / SUV","PKW"]
[{"$f":"A17+1","v":6},null,"",{"$f":"IF($B18>0,IF(Fahrzeuge!$C$1=\"nein\",VLOOKUP($B18,$N$37:$V$262,4,0),IF(Fahrzeuge!$C$1=\"ja\",VLOOKUP($B18,$N$37:$V$262,3,0),\"Bitte wählen sie aus, ob sie zum Vorsteuerabzug berechtigt sind!\")),\"\")","v":""},"",{"$f":"IF($B18>0,IF(Fahrzeuge!$C$1=\"nein\",VLOOKUP($B18,$N$37:$V$262,7,0),IF(Fahrzeuge!$C$1=\"ja\",VLOOKUP($B18,$N$37:$V$262,6,0),\"Bitte wählen sie aus, ob sie zum Vorsteuerabzug berechtigt sind!\")),\"\")","v":""},"",null,null,"","",{"$nulls":31},"jetzt 120Ah statt 94Ah","BMW i3 (42,2 kWh, 37,9 kWh nutzbar)",null,44067.23,50134.46,"BMW 218 i Active Tourer",24789.919999999998,29500,19277,20634,"Kleinwagen","PKW"]
[7,null,"",{"$f":"IF($B19>0,IF(Fahrzeuge!$C$1=\"nein\",VLOOKUP($B19,$N$37:$V$262,4,0),IF(Fahrzeuge!$C$1=\"ja\",VLOOKUP($B19,$N$37:$V$262,3,0),\"Bitte wählen sie aus, ob sie zum Vorsteuerabzug berechtigt sind!\")),\"\")","v":""},"",{"$f":"IF($B19>0,IF(Fahrzeuge!$C$1=\"nein\",VLOOKUP($B19,$N$37:$V$262,7,0),IF(Fahrzeuge!$C$1=\"ja\",VLOOKUP($B19,$N$37:$V$262,6,0),\"Bitte wählen sie aus, ob sie zum Vorsteuerabzug berechtigt sind!\")),\"\")","v":""},"",null,null,"","",{"$nulls":31},"jetzt 120Ah statt 94Ah","BMW i3s (42,2 kWh, 37,9 kWh nutzbar)",null,48242.02,54884.04,"BMW 218 i Active Tourer Sport Line",28865.55,34350,19376,20534,"Kleinwagen","PKW"]
[8,null,"",{"$f":"IF($B20>0,IF(Fahrzeuge!$C$1=\"nein\",VLOOKUP($B20,$N$37:$V$262,4,0),IF(Fahrzeuge!$C$1=\"ja\",VLOOKUP($B20,$N$37:$V$262,3,0),\"Bitte wählen sie aus, ob sie zum Vorsteuerabzug berechtigt sind!\")),\"\")","v":""},"",{"$f":"IF($B20>0,IF(Fahrzeuge!$C$1=\"nein\",VLOOKUP($B20,$N$37:$V$262,7,0),IF(Fahrzeuge!$C$1=\"ja\",VLOOKUP($B20,$N$37:$V$262,6,0),\"Bitte wählen sie aus, ob sie zum Vorsteuerabzug berechtigt sind!\")),\"\")","v":""},"",null,null,"","",{"$nulls":31},"46g CO2 /km; 40 km e-Reichweite","BMW i8 Roadster","x",{"$f":"ROUND(AU20/1.19,2)","v":130252.1},155000,"Porsche 911 Carrera 4S Cabrio",127948.74,152259,2303,2741,"Sportwagen","PKW"]
{"$rows_left_out":243}
{"sheet":"LKW, Busse, Sonderfahrzeuge","index":2,"n_rows":27,"n_cols":11,"rows_kept":27,"cut":false,"hidden":false,"merged":[[2,0,2,9],[3,0,3,9],[0,0,0,9]]}
["Ermittlung der förderfähigen Ausgaben für LKW, Busse und Sonder-Fahrzeuge",{"$nulls":9},"FKZ:"]
["Hinweise:"]
["Hierfür müssen Sie entsprechende Angebote für das E-Fahrzeug und ein Referenzfahrzeug eingeholt haben. Diese Angebote sind beizufügen."]
[{"$f":"IF(Fahrzeuge!C1=\"\",\"Bitte geben Sie auf der Registerkarte 'Fahrzeuge'  an, ob Sie zum Vorsteuerabzug berechtigt sind\",\"\")","v":"Bitte geben Sie auf der Registerkarte 'Fahrzeuge'  an, ob Sie zum Vorsteuerabzug berechtigt sind"}]
[]
["Pos.","Typ E-Fahrzeug",{"$f":"IF(Fahrzeuge!$C$1=\"nein\",\"Bruttopreis\nE-Fahrzeug laut beigefügtem Angebot *\",IF(Fahrzeuge!$C$1=\"ja\",\"Nettopreis\nE-Fahrzeug laut beigefügtem Angebot *\",\"Bitte wählen sie aus, ob sie zum Vorsteuerabzug berechtigt sind!\"))","v":"Bitte wählen sie aus, ob sie zum Vorsteuerabzug berechtigt sind!"},"Typ Referenzfahrzeug",{"$f":"IF(Fahrzeuge!$C$1=\"nein\",\"Bruttopreis Referenzfahrzeug\nlaut beigefügtem Angebot *\",IF(Fahrzeuge!$C$1=\"ja\",\"Nettopreis Referenzfahrzeug\nlaut beigefügtem Angebot *\",\"Bitte wählen sie aus, ob sie zum Vorsteuerabzug berechtigt sind!\"))","v":"Bitte wählen sie aus, ob sie zum Vorsteuerabzug berechtigt sind!"},{"$f":"IF(Fahrzeuge!$C$1=\"nein\",\"Förderfähige Ausgaben pro Fahrzeug (brutto)\",IF(Fahrzeuge!$C$1=\"ja\",\"Förderfähige Ausgaben pro Fahrzeug (netto)\",\"Bitte wählen sie aus, ob sie zum Vorsteuerabzug berechtigt sind!\"))","v":"Bitte wählen sie aus, ob sie zum Vorsteuerabzug berechtigt sind!"},"Anzahl zu beschaffender Fahrzeuge des Typs","erwartete durchschnittliche Jahres-Fahrleistung in km*","* alternativ: erwartete Jahresbetriebs-stunden","Förderfähige Ausgaben ","Korrekturfeld PtJ"]
[1,{"$nulls":4},{"$f":"IF(B7>\"\",IF($A$4=\"\",C7-E7,$F$6),\"\")","v":""},null,null,null,{"$f":"IF(B7>\"\",F7*G7,\"\")","v":""}]
[]
[2,{"$nulls":4},{"$f":"IF(B9>\"\",IF($A$4=\"\",C9-E9,$F$6),\"\")","v":""},null,null,null,{"$f":"IF(B9>\"\",F9*G9,\"\")","v":""}]
[]
[3,{"$nulls":4},"",null,null,null,""]
[]
[4,{"$nulls":4},"",null,null,null,""]
[]
[5,{"$nulls":4},"",null,null,null,""]
[]
[6,{"$nulls":4},"",null,null,null,""]
[]
[7,{"$nulls":4},"",null,null,null,""]
[]
{"$rows_left_out":8}
{"sheet":"Ladeinfrastruktur","index":3,"n_rows":31,"n_cols":11,"rows_kept":31,"cut":false,"hidden":false,"merged":[[2,0,2,5],[27,1,27,5]]}
["Ermittlung der förderfähigen Pauschalen für Ladeinfrastruktur",{"$nulls":4},"FKZ:"]
["Hinweis:"]
[{"$f":"IF(Fahrzeuge!C1=\"\",\"Bitte geben Sie auf der Registerkarte 'Fahrzeuge'  an, ob Sie zum Vorsteuerabzug berechtigt sind\",\"\")","v":"Bitte geben Sie auf der Registerkarte 'Fahrzeuge'  an, ob Sie zum Vorsteuerabzug berechtigt sind"}]
[]
["Pos.","Typ Ladeinfrastruktur (LIS)*\n[Auswahlbox]",{"$f":"IF(Fahrzeuge!$C$1=\"nein\",\"Förderfähige Ausgaben pro Ladesäule (brutto)\",IF(Fahrzeuge!$C$1=\"ja\",\"Förderfähige Ausgaben pro Ladesäule (netto)\",\"Bitte wählen sie aus, ob sie zum Vorsteuerabzug berechtigt sind!\"))","v":"Bitte wählen sie aus, ob sie zum Vorsteuerabzug berechtigt sind!"},"Anzahl zu beschaffender Ladesäulen des Typs","Förderfähige Ausgaben ","Korrekturfeld PtJ",null,null,"Typ Ladeinfrastruktur","Ausgabenpauschale netto","Ausgabenpauschale netto"]
[1,null,{"$f":"IF($B6>0,IF(Fahrzeuge!$C$1=\"nein\",VLOOKUP($B6,$I$6:$K$15,3,0),IF(Fahrzeuge!$C$1=\"ja\",VLOOKUP($B6,$I$6:$K$15,2,0),\"Bitte wählen sie aus, ob sie zum Vorsteuerabzug berechtigt sind!\")),\"\")","v":""},null,{"$f":"IF(AND(B6<>\"\",D6>0),C6*D6,\"\")","v":""},null,null,null,"öff. zugängl. [AC] ≥ 3,7 kW (1 Ladepunkt)",2000,{"$f":"J6*1.19","v":2380}]
[{"$nulls":8},"öff. zugängl. [AC] ≥ 11 kW (min. 2 Ladepunkte)",5000,{"$f":"J7*1.19","v":5950}]
[2,null,{"$f":"IF($B8>0,IF(Fahrzeuge!$C$1=\"nein\",VLOOKUP($B8,$I$6:$K$15,3,0),IF(Fahrzeuge!$C$1=\"ja\",VLOOKUP($B8,$I$6:$K$15,2,0),\"Bitte wählen sie aus, ob sie zum Vorsteuerabzug berechtigt sind!\")),\"\")","v":""},null,{"$f":"IF(AND(B8<>\"\",D8>0),C8*D8,\"\")","v":""},null,null,null,"öff. zugängl. [DC] ≤ 50 kW",20000,23800]
[{"$nulls":8},"öff. zugängl. [DC] 51 kW-149 kW",35000,41650]
[3,null,{"$f":"IF($B10>0,IF(Fahrzeuge!$C$1=\"nein\",VLOOKUP($B10,$I$6:$K$15,3,0),IF(Fahrzeuge!$C$1=\"ja\",VLOOKUP($B10,$I$6:$K$15,2,0),\"Bitte wählen sie aus, ob sie zum Vorsteuerabzug berechtigt sind!\")),\"\")","v":""},null,{"$f":"IF(AND(B10<>\"\",D10>0),C10*D10,\"\")","v":""},null,null,null,"öff. zugängl. [DC] ≥ 150 kW",50000,59500]
[{"$nulls":8},"nicht öff. zugängl. [AC] ≥ 3,7 kW (1 Ladepunkt)",900,1071]
[4,null,{"$f":"IF($B12>0,IF(Fahrzeuge!$C$1=\"nein\",VLOOKUP($B12,$I$6:$K$15,3,0),IF(Fahrzeuge!$C$1=\"ja\",VLOOKUP($B12,$I$6:$K$15,2,0),\"Bitte wählen sie aus, ob sie zum Vorsteuerabzug berechtigt sind!\")),\"\")","v":""},null,{"$f":"IF(AND(B12<>\"\",D12>0),C12*D12,\"\")","v":""},null,null,null,"nicht öff. zugängl. [AC] ≥ 11 kW (min. 2 Ladepunkte)",3000,3570]
[{"$nulls":8},"nicht öff. zugängl. [DC] ≤ 50 kW",20000,23800]
[5,null,{"$f":"IF($B14>0,IF(Fahrzeuge!$C$1=\"nein\",VLOOKUP($B14,$I$6:$K$15,3,0),IF(Fahrzeuge!$C$1=\"ja\",VLOOKUP($B14,$I$6:$K$15,2,0),\"Bitte wählen sie aus, ob sie zum Vorsteuerabzug berechtigt sind!\")),\"\")","v":""},null,{"$f":"IF(AND(B14<>\"\",D14>0),C14*D14,\"\")","v":""},null,null,null,"nicht öff. zugängl. [DC] 51 kW-149 kW",35000,41650]
[{"$nulls":8},"nicht öff. zugängl. [DC] ≥ 150 kW",50000,59500]
[6,null,{"$f":"IF($B16>0,IF(Fahrzeuge!$C$1=\"nein\",VLOOKUP($B16,$I$6:$K$15,3,0),IF(Fahrzeuge!$C$1=\"ja\",VLOOKUP($B16,$I$6:$K$15,2,0),\"Bitte wählen sie aus, ob sie zum Vorsteuerabzug berechtigt sind!\")),\"\")","v":""},null,{"$f":"IF(AND(B16<>\"\",D16>0),C16*D16,\"\")","v":""}]
[]
[7,null,{"$f":"IF($B18>0,IF(Fahrzeuge!$C$1=\"nein\",VLOOKUP($B18,$I$6:$K$15,3,0),IF(Fahrzeuge!$C$1=\"ja\",VLOOKUP($B18,$I$6:$K$15,2,0),\"Bitte wählen sie aus, ob sie zum Vorsteuerabzug berechtigt sind!\")),\"\")","v":""},null,{"$f":"IF(AND(B18<>\"\",D18>0),C18*D18,\"\")","v":""}]
[]
[8,null,{"$f":"IF($B20>0,IF(Fahrzeuge!$C$1=\"nein\",VLOOKUP($B20,$I$6:$K$15,3,0),IF(Fahrzeuge!$C$1=\"ja\",VLOOKUP($B20,$I$6:$K$15,2,0),\"Bitte wählen sie aus, ob sie zum Vorsteuerabzug berechtigt sind!\")),\"\")","v":""},null,{"$f":"IF(AND(B20<>\"\",D20>0),C20*D20,\"\")","v":""}]
{"$rows_left_out":12}
{"sheet":"spezielle Ladeinfrastruktur","index":4,"n_rows":27,"n_cols":7,"rows_kept":27,"cut":false,"hidden":false,"merged":[[27,0,27,5],[2,0,2,6],[0,0,0,3]]}
["Ermittlung der förderfähigen Ausgaben für Ladeinfrastruktur die nicht in der Registerkarte \"Ladeinfrastruktur\" aufgeführt wird",{"$nulls":5},"FKZ:"]
["Hinweise:"]
["Hierfür müssen Sie entsprechende Angebote für die Ladeinfrastruktur eingeholt haben. Diese Angebote sind beizufügen."]
[{"$f":"IF(Fahrzeuge!C1=\"\",\"Bitte geben Sie auf der Registerkarte 'Fahrzeuge'  an, ob Sie zum Vorsteuerabzug berechtigt sind\",\"\")","v":"Bitte geben Sie auf der Registerkarte 'Fahrzeuge'  an, ob Sie zum Vorsteuerabzug berechtigt sind"}]
[]
["Pos.","Typ Ladeinfrastruktur (LIS)",{"$f":"IF(Fahrzeuge!$C$1=\"nein\",\"Bruttopreis LIS laut beigefügtem Angebot *\",IF(Fahrzeuge!$C$1=\"ja\",\"Nettopreis LIS laut beigefügtem Angebot *\",\"Bitte wählen sie aus, ob sie zum Vorsteuerabzug berechtigt sind!\"))","v":"Bitte wählen sie aus, ob sie zum Vorsteuerabzug berechtigt sind!"},"Anzahl zu beschaffender LIS dieses Typs","Förderfähige Ausgaben ","Korrekturfeld PtJ"]
[1,null,null,null,{"$f":"IF(Fahrzeuge!$C$1>\"\",IF(AND(B7<>\"\",C7>0),D7*C7,\"\"),\"Bitte wählen sie aus, ob sie zum Vorsteuerabzug berechtigt sind!\")","v":"Bitte wählen sie aus, ob sie zum Vorsteuerabzug berechtigt sind!"}]
[]
[2,null,null,null,{"$f":"IF(Fahrzeuge!$C$1>\"\",IF(AND(B9<>\"\",C9>0),D9*C9,\"\"),\"Bitte wählen sie aus, ob sie zum Vorsteuerabzug berechtigt sind!\")","v":"Bitte wählen sie aus, ob sie zum Vorsteuerabzug berechtigt sind!"}]
[]
[3,null,null,null,{"$f":"IF(Fahrzeuge!$C$1>\"\",IF(AND(B11<>\"\",C11>0),D11*C11,\"\"),\"Bitte wählen sie aus, ob sie zum Vorsteuerabzug berechtigt sind!\")","v":"Bitte wählen sie aus, ob sie zum Vorsteuerabzug berechtigt sind!"}]
[]
[4,null,null,null,{"$f":"IF(Fahrzeuge!$C$1>\"\",IF(AND(B13<>\"\",C13>0),D13*C13,\"\"),\"Bitte wählen sie aus, ob sie zum Vorsteuerabzug berechtigt sind!\")","v":"Bitte wählen sie aus, ob sie zum Vorsteuerabzug berechtigt sind!"}]
[]
[5,null,null,null,{"$f":"IF(Fahrzeuge!$C$1>\"\",IF(AND(B15<>\"\",C15>0),D15*C15,\"\"),\"Bitte wählen sie aus, ob sie zum Vorsteuerabzug berechtigt sind!\")","v":"Bitte wählen sie aus, ob sie zum Vorsteuerabzug berechtigt sind!"}]
[]
[6,null,null,null,{"$f":"IF(Fahrzeuge!$C$1>\"\",IF(AND(B17<>\"\",C17>0),D17*C17,\"\"),\"Bitte wählen sie aus, ob sie zum Vorsteuerabzug berechtigt sind!\")","v":"Bitte wählen sie aus, ob sie zum Vorsteuerabzug berechtigt sind!"}]
[]
[7,null,null,null,{"$f":"IF(Fahrzeuge!$C$1>\"\",IF(AND(B19<>\"\",C19>0),D19*C19,\"\"),\"Bitte wählen sie aus, ob sie zum Vorsteuerabzug berechtigt sind!\")","v":"Bitte wählen sie aus, ob sie zum Vorsteuerabzug berechtigt sind!"}]
[]
{"$rows_left_out":8}
{"sheet":"Vorlage für AZA","index":5,"n_rows":61,"n_cols":5,"rows_kept":61,"cut":false,"hidden":false,"merged":[[2,0,2,7],[7,0,7,7],[4,0,4,7],[5,0,5,7]]}
["Hinweis:"]
[]
["Vorlage zum Übertragen der Daten aus dieser Tabelle in den AZA in easyOnline, die Anzahl der zu beschaffenden Fzg. / LIS muss ggf. auf die Anschaffungsjahre aufgeteilt werden"]
[]
[{"$f":"IF(Fahrzeuge!$C$1=\"nein\",\"Der Antragsteller ist nicht zum Vorsteuerabzug berechtigt.\",IF(Fahrzeuge!$C$1=\"ja\",\"Der Antragsteller ist zum Vorsteuerabzug berechtigt.\",\"Bitte wählen sie aus, ob sie zum Vorsteuerabzug berechtigt sind!\"))","v":"Bitte wählen sie aus, ob sie zum Vorsteuerabzug berechtigt sind!"}]
["(sollte diese Aussage nicht zutreffen, wählen Sie bitte die entsprechende Option auf der Registerkarte \"Fahrzeuge\")"]
[]
["Gesamtfinanzierung - Gegenstände und andere Investitionen von mehr als 410 € im Einzelfall"]
[]
["lfd. Nr.","Bezeichnung","Zuwendungsfähige\nAusgaben / Stück*","Anzahl*","F0833 Betrag €"]
[{"$f":"IF(Fahrzeuge!$B13>\"\",Fahrzeuge!A13,0)","v":0},{"$f":"IF(Fahrzeuge!$B13>\"\",CONCATENATE(LEFT(RIGHT(Fahrzeuge!C13,4),3),\" \",Fahrzeuge!B13),\"\")","v":""},{"$f":"IF(Fahrzeuge!$B13>\"\",Fahrzeuge!G13,\"\")","v":""},{"$f":"IF(Fahrzeuge!$B13>\"\",Fahrzeuge!H13,\"\")","v":""},{"$f":"IF(Fahrzeuge!$B13>\"\",Fahrzeuge!K13,\"\")","v":""}]
[{"$f":"IF(Fahrzeuge!B14>\"\",Fahrzeuge!A14,A11)","v":0},{"$f":"IF(Fahrzeuge!$B14>\"\",CONCATENATE(LEFT(RIGHT(Fahrzeuge!C14,4),3),\" \",Fahrzeuge!B14),\"\")","v":""},{"$f":"IF(Fahrzeuge!$B14>\"\",Fahrzeuge!G14,\"\")","v":""},{"$f":"IF(Fahrzeuge!$B14>\"\",Fahrzeuge!H14,\"\")","v":""},{"$f":"IF(Fahrzeuge!$B14>\"\",Fahrzeuge!K14,\"\")","v":""}]
[{"$f":"IF(Fahrzeuge!B15>\"\",Fahrzeuge!A15,A12)","v":0},{"$f":"IF(Fahrzeuge!$B15>\"\",CONCATENATE(LEFT(RIGHT(Fahrzeuge!C15,4),3),\" \",Fahrzeuge!B15),\"\")","v":""},{"$f":"IF(Fahrzeuge!$B15>\"\",Fahrzeuge!G15,\"\")","v":""},{"$f":"IF(Fahrzeuge!$B15>\"\",Fahrzeuge!H15,\"\")","v":""},{"$f":"IF(Fahrzeuge!$B15>\"\",Fahrzeuge!K15,\"\")","v":""}]
[{"$f":"IF(Fahrzeuge!B16>\"\",Fahrzeuge!A16,A13)","v":0},{"$f":"IF(Fahrzeuge!$B16>\"\",CONCATENATE(LEFT(RIGHT(Fahrzeuge!C16,4),3),\" \",Fahrzeuge!B16),\"\")","v":""},{"$f":"IF(Fahrzeuge!$B16>\"\",Fahrzeuge!G16,\"\")","v":""},{"$f":"IF(Fahrzeuge!$B16>\"\",Fahrzeuge!H16,\"\")","v":""},{"$f":"IF(Fahrzeuge!$B16>\"\",Fahrzeuge!K16,\"\")","v":""}]
[{"$f":"IF(Fahrzeuge!B17>\"\",Fahrzeuge!A17,A14)","v":0},{"$f":"IF(Fahrzeuge!$B17>\"\",CONCATENATE(LEFT(RIGHT(Fahrzeuge!C17,4),3),\" \",Fahrzeuge!B17),\"\")","v":""},{"$f":"IF(Fahrzeuge!$B17>\"\",Fahrzeuge!G17,\"\")","v":""},{"$f":"IF(Fahrzeuge!$B17>\"\",Fahrzeuge!H17,\"\")","v":""},{"$f":"IF(Fahrzeuge!$B17>\"\",Fahrzeuge!K17,\"\")","v":""}]
[{"$f":"IF(Fahrzeuge!B18>\"\",Fahrzeuge!A18,A15)","v":0},{"$f":"IF(Fahrzeuge!$B18>\"\",CONCATENATE(LEFT(RIGHT(Fahrzeuge!C18,4),3),\" \",Fahrzeuge!B18),\"\")","v":""},{"$f":"IF(Fahrzeuge!$B18>\"\",Fahrzeuge!G18,\"\")","v":""},{"$f":"IF(Fahrzeuge!$B18>\"\",Fahrzeuge!H18,\"\")","v":""},{"$f":"IF(Fahrzeuge!$B18>\"\",Fahrzeuge!K18,\"\")","v":""}]
[{"$f":"IF(Fahrzeuge!B19>\"\",Fahrzeuge!A19,A16)","v":0},{"$f":"IF(Fahrzeuge!$B19>\"\",CONCATENATE(LEFT(RIGHT(Fahrzeuge!C19,4),3),\" \",Fahrzeuge!B19),\"\")","v":""},{"$f":"IF(Fahrzeuge!$B19>\"\",Fahrzeuge!G19,\"\")","v":""},{"$f":"IF(Fahrzeuge!$B19>\"\",Fahrzeuge!H19,\"\")","v":""},{"$f":"IF(Fahrzeuge!$B19>\"\",Fahrzeuge!K19,\"\")","v":""}]
[{"$f":"IF(Fahrzeuge!B20>\"\",Fahrzeuge!A20,A17)","v":0},{"$f":"IF(Fahrzeuge!$B20>\"\",CONCATENATE(LEFT(RIGHT(Fahrzeuge!C20,4),3),\" \",Fahrzeuge!B20),\"\")","v":""},{"$f":"IF(Fahrzeuge!$B20>\"\",Fahrzeuge!G20,\"\")","v":""},{"$f":"IF(Fahrzeuge!$B20>\"\",Fahrzeuge!H20,\"\")","v":""},{"$f":"IF(Fahrzeuge!$B20>\"\",Fahrzeuge!K20,\"\")","v":""}]
[{"$f":"IF(Fahrzeuge!B21>\"\",Fahrzeuge!A21,A18)","v":0},{"$f":"IF(Fahrzeuge!$B21>\"\",CONCATENATE(LEFT(RIGHT(Fahrzeuge!C21,4),3),\" \",Fahrzeuge!B21),\"\")","v":""},{"$f":"IF(Fahrzeuge!$B21>\"\",Fahrzeuge!G21,\"\")","v":""},{"$f":"IF(Fahrzeuge!$B21>\"\",Fahrzeuge!H21,\"\")","v":""},{"$f":"IF(Fahrzeuge!$B21>\"\",Fahrzeuge!K21,\"\")","v":""}]
[{"$f":"IF(Fahrzeuge!B22>\"\",Fahrzeuge!A22,A19)","v":0},{"$f":"IF(Fahrzeuge!$B22>\"\",CONCATENATE(LEFT(RIGHT(Fahrzeuge!C22,4),3),\" \",Fahrzeuge!B22),\"\")","v":""},{"$f":"IF(Fahrzeuge!$B22>\"\",Fahrzeuge!G22,\"\")","v":""},{"$f":"IF(Fahrzeuge!$B22>\"\",Fahrzeuge!H22,\"\")","v":""},{"$f":"IF(Fahrzeuge!$B22>\"\",Fahrzeuge!K22,\"\")","v":""}]
{"$rows_left_out":41}