{"text_format":"2","workbook":"xlsx","n_sheets":6,"sheets":["Projektdaten","Fahrzeuge","sonst. PKW u. LFZ","Ladeinfrastruktur","spezielle Ladeinfrastruktur","Vorlage für AZA"],"not_rendered":{"charts":0,"images":1,"macros":0,"external_links":0,"defined_names":31,"comments":1,"pivot_tables":1},"unopened":[],"bounds":{"document_bytes":16777216,"sheet_cells":100000,"run_cost":"one","rows_first":2000,"rows_last":500,"rows_between":2000,"halvings":0,"cell_chars":16384,"cell_head_chars":4096},"cells_cut":0,"cells_raw":0,"read":"whole","date_system":"1900"}

{"sheet":"Projektdaten","index":0,"n_rows":50,"n_cols":23,"rows_kept":50,"cut":false,"hidden":true,"merged":[[35,1,43,1],[19,0,19,3],[21,0,49,0],[44,1,49,1],[0,0,0,4],[1,0,1,4],[3,0,17,6],[20,0,20,3],[21,1,25,1],[26,1,34,1]]}
["Tabelle zur Ermittlung der förderfähigen Ausgaben (EfA)"]
["Anlage 2 zum Aufruf zur Antragseinreichung zur Förderung von E-Fahrzeugen und notwendiger Ladeinfrastruktur (02/2021)\n"]
[]
["Mithilfe dieser Tabelle können Sie die Grundlage für Ihre Förderung berechnen. Die Fördersumme berechnet sich aus der Multiplikation der hier berechneten förderfähigen Ausgaben mit der Förderquote. Bitte befüllen Sie diese Anlage, bevor Sie den Antrag in easy-Online ausfüllen. Im Reiter \"Fahrzeuge\" finden Sie als Auswahlfeld alle Fahrzeuge, für die aktuelle Preislisten veröffentlicht wurden. Für diese Fahrzeuge werden Pauschalen ausgezahlt. Nur wenn das Fahrzeug, welches Sie beantragen möchten, nicht darunter ist, können Sie es im Reiter \"Sonderfahrzeuge\" selbst eingeben. Gleiches gilt analog für den Bereich Ladeinfrastruktur.\n\nÜbertragung in easy-Online:\nIm letzten Reiter \"Vorlage für AZA\" finden Sie eine Aufstellung Ihrer Fördergegenstände. Bitte übertragen Sie diese in Ihr easy-Online Formular unter der Rubrik \"Gesamtfinanzierung\". Als \"Preis € / Stück\" werden die förderfähigen Ausgaben aus der EfA-Tabelle eingetragen.\n\nÜbermitteln Sie uns die Tabelle bitte in drei Varianten:\n1. Im pdf-Format als Anhang zum easy-Online Antrag, \n2. als Ausdruck per Post als Anlage zum Antrag sowie\n3. im Excel-Format per E-Mail für die Begleitforschung an: elektromobilitaet@now-gmbh.de"]
{"$rows_empty":15}
["Übersichtsblatt Stammdaten - Bitte tragen Sie Ihre Projektdaten ein"]
["Bitte beantworten Sie diese Fragen wahrheitsgemäß. Diese Angaben haben keinen Einfluss auf die Förderung, \nsie dienen ausschließlich der statistischen Auswertung und Weiterentwicklung des Förderprogramms.",{"$nulls":14},"JAoNEIN","Antragsteller","Raumkategorie","Einsatzkontext","Einsatzgebiet","Standortyp","Beschilderung","E/E"]
["Projekt","Allgemeine Infornationen","Projekt-Kurzbezeichnung (Akronym)",{"$nulls":12},"Ja","gewerblich","Großstadt/Metropolregion > 500.000 EW","Carsharing (fester Stellplatz)","überwiegend städtisch","Firmenparkplatz (Flotte)","Negative Beschilderung mit Zeichen 286,  290.1","nein"]
[null,null,"Projekt-Beschreibung (Titel)",{"$nulls":12},"Nein","kommunal","Großstadt > 100.000 EW","Carsharing (mehrere feste Stellplätze)","überwiegend ländlich","Halböffentlich","Positive Beschilderung mit Zeichen 314, 314.1, 315","PV"]
[null,null,"Ausführende Institution",{"$nulls":14},"Mittelstadt > 50.000 EW","CarSharing (Float)","beides zu gleichen Teilen","Öffentlich am Wohnort","Nein","Wind"]
[null,null,"Raumkategorie",{"$nulls":14},"Kleinstadt > 10.000 EW","Dienstwagen",null,"Öffentlich zentral",null,"PV & Wind"]
[null,null,"Gibt es einen Bezug zu einem aktuell laufenden oder beantragten Forschungs- und Entwicklungsprojekt?",{"$nulls":14},"Stadt/Gemeinde < 10.000 EW","Flotte (Firmen)",null,"Privat"]
[null,"Fahrzeug","Anzahl Fahrzeuge im gesamten Fuhrpark",{"$nulls":14},"Landgemeinde","Flotte (Kommunal)",null,"Firmenparkplatz (private Nutzung)"]
[null,null,"             davon bereits E-Fahrzeuge",{"$nulls":14},"ausserhalb einer Ansiedlung","Flotte (Mietwagen)",null,"Firmen- oder Betriebsgelände "]
[null,null,"Einsatzkontext",{"$nulls":15},"ÖPNV-Flotte"]
[null,null,"Planen sie weitere Umstellungen auf alternative Antriebe innerhalb ihrer Flotte bis 2025 (bezogen auf die Gesamtanzahl in Zeile 27)?",{"$nulls":15},"Privatwagen"]
[null,null,"Falls ja: Anzahl der Umstellung in den kommenden 1-2 Jahren (2021/22)",{"$nulls":15},"Lieferverkehr"]
[null,null,"Falls ja: Anzahl der Umstellung in den darauffolgenden 1-3 Jahren (2023 – 2025)",{"$nulls":15},"Taxi"]
[null,null,"Ersetzen die beantragten E-Fahrzeuge  vorhandene konventionelle Fahrzeuge?",{"$nulls":15},"Leasing"]
[null,null,"Fahren Ihre Fahrzeuge überwiegend im Stadtgebiet?",{"$nulls":15},"Ride-Pooling, Ride-Hailing, Ride-Sharing"]
{"$rows_left_out":17}
{"sheet":"Fahrzeuge","index":1,"n_rows":297,"n_cols":35,"rows_kept":297,"cut":false,"hidden":false,"merged":[[5,0,5,1],[6,0,6,1],[7,0,7,1]]}
["Tabelle zur Ermittlung der förderfähigen Ausgaben (EfA)",null,null,null,"ja","nein","Stand: 09.03.2023",null,null,null,"FKZ: 03EMI6",null," "]
["Hinweise:",{"$nulls":5},"ergänzt: 07.02.2025"]
["Die Registerkarte 'Vorlage für AZA' stellt Ihre Eingaben so dar, wie sie in das easyOnline-Formular eingetragen werden müssen.",{"$nulls":5},"korrigiert: 05.09.2024"]
[]
["Bitte füllen Sie zunächst die folgenden Auswahlfelder aus:"]
["Antragsteller ist vorsteuerabzugsberechtigt [Auswahlbox]:"]
["Antragsteller ist zur Ausschreibung verpflichtet [Auswahbox]:",null,"nein"]
["Antragsteller ist selbst antragsberechtigt für \nden BaFa-Umweltbonus [Auswahbox]:"]
["Wählen Sie in der Liste unten die gewünschten Fahrzeuge (Auswahlbox) und die entsprechende Anzahl aus."]
["Für Ladeinfrastruktur wählen Sie bitte die entsprechenden Registerkarte."]
["Speichern Sie alle Arbeitsblätter (3 Seiten) als PDF und fügen Sie sie dem Antrag bei."]
["Grün unterlegte Felder sind Eingabefelder."]
[]
["Pos.","Typ E-Fahrzeug\n[Auswahlbox]","Fahrzeugsegment nach Kraftfahrt-Bundesamt",{"$f":"IF(Fahrzeuge!$C$6=\"nein\",\"Bruttopreis\nE-Fahrzeug\",IF(Fahrzeuge!$C$6=\"ja\",\"Nettopreis\nE-Fahrzeug\",\"Bitte wählen sie aus, ob sie zum Vorsteuerabzug berechtigt sind!\"))","v":"Bitte wählen sie aus, ob sie zum Vorsteuerabzug berechtigt sind!"},"Typ Referenzfahrzeug",{"$f":"IF(Fahrzeuge!$C$6=\"nein\",\"Bruttopreis\nReferenzfahrzeug\",IF(Fahrzeuge!$C$6=\"ja\",\"Nettopreis\nReferenzfahrzeug\",\"Bitte wählen sie aus, ob sie zum Vorsteuerabzug berechtigt sind!\"))","v":"Bitte wählen sie aus, ob sie zum Vorsteuerabzug berechtigt sind!"},{"$f":"IF($C$6=\"nein\",\"Förderfähige Ausgaben pro Fahrzeug (brutto)\",IF($C$6=\"ja\",\"Förderfähige Ausgaben pro Fahrzeug (netto)\",\"Bitte wählen sie aus, ob sie zum Vorsteuerabzug berechtigt sind!\"))","v":"Bitte wählen sie aus, ob sie zum Vorsteuerabzug berechtigt sind!"},{"$f":"IF($C$8=\"ja\",\"Information*: \"&G14&\" nach Anrechnung des Umweltbonus\",\"\")","v":""},"Anzahl zu beschaffender Fahrzeuge des Typs","erwartete durchschnittliche Jahres- Fahrleistung pro Fahrzeug in km","Förderfähige Ausgaben ","Korrekturfeld PtJ",{"$nulls":22},"Fahrzeugklasse Abkürzungen"]
[1,null,{"$f":" IF(B15>0,CONCATENATE(VLOOKUP(B15,N40:W278,9,0),\" (\",VLOOKUP(B15,N40:W278,10,0),\")\"),\"\")","v":""},{"$f":"IF($B15>0,IF(Fahrzeuge!$C$6=\"nein\",VLOOKUP($B15,$N$40:$U$278,3,0),IF(Fahrzeuge!$C$6=\"ja\",VLOOKUP($B15,$N$40:$U$278,2,0),\"Bitte wählen sie aus, ob sie zum Vorsteuerabzug berechtigt sind!\")),\"\")","v":""},{"$f":"IF($B15>0,VLOOKUP($B15,$N$40:$U$278,4,0),\"\")","v":""},{"$f":"IF($B15>0,IF(Fahrzeuge!$C$6=\"nein\",VLOOKUP($B15,$N$40:$U$278,6,0),IF(Fahrzeuge!$C$6=\"ja\",VLOOKUP($B15,$N$40:$U$278,5,0),\"Bitte wählen sie aus, ob sie zum Vorsteuerabzug berechtigt sind!\")),\"\")","v":""},{"$f":"IF(B15>0,IF($C$6=\"nein\",VLOOKUP($B15,$N$40:$U$278,8,0),IF($C$6=\"ja\",VLOOKUP($B15,$N$40:$U$278,7,0),\"Bitte wählen sie aus, ob sie zum Vorsteuerabzug berechtigt sind!\")),\"\")","v":""},{"$f":"IF($H$14>\"\",IF(B15>0,IF($C$6=\"nein\",VLOOKUP($B15,$N$40:$AA$272,14,0),IF($C$6=\"ja\",VLOOKUP($B15,$N$40:$AA$272,13,0),\"\")),\"\"),\"\")","v":""},null,null,{"$f":"IF(B15>0,G15*I15,\"\")","v":""},{"$nulls":23},{"$f":"VLOOKUP($B15,N$39:W$278,10,FALSE)","v":{"$error":"#N/A"}}]
[{"$f":"A15+1","v":2},null,{"$f":" IF(B16>0,CONCATENATE(VLOOKUP(B16,N40:W278,9,0),\" (\",VLOOKUP(B16,N40:W278,10,0),\")\"),\"\")","v":""},{"$f":"IF($B16>0,IF(Fahrzeuge!$C$6=\"nein\",VLOOKUP($B16,$N$40:$U$278,3,0),IF(Fahrzeuge!$C$6=\"ja\",VLOOKUP($B16,$N$40:$U$278,2,0),\"Bitte wählen sie aus, ob sie zum Vorsteuerabzug berechtigt sind!\")),\"\")","v":""},"",{"$f":"IF($B16>0,IF(Fahrzeuge!$C$6=\"nein\",VLOOKUP($B16,$N$40:$U$278,6,0),IF(Fahrzeuge!$C$6=\"ja\",VLOOKUP($B16,$N$40:$U$278,5,0),\"Bitte wählen sie aus, ob sie zum Vorsteuerabzug berechtigt sind!\")),\"\")","v":""},"","",null,null,"",{"$nulls":23},{"$error":"#N/A"}]
[{"$f":"A16+1","v":3},null,{"$f":" IF(B17>0,CONCATENATE(VLOOKUP(B17,N40:W278,9,0),\" (\",VLOOKUP(B17,N40:W278,10,0),\")\"),\"\")","v":""},{"$f":"IF($B17>0,IF(Fahrzeuge!$C$6=\"nein\",VLOOKUP($B17,$N$40:$U$278,3,0),IF(Fahrzeuge!$C$6=\"ja\",VLOOKUP($B17,$N$40:$U$278,2,0),\"Bitte wählen sie aus, ob sie zum Vorsteuerabzug berechtigt sind!\")),\"\")","v":""},"",{"$f":"IF($B17>0,IF(Fahrzeuge!$C$6=\"nein\",VLOOKUP($B17,$N$40:$U$278,6,0),IF(Fahrzeuge!$C$6=\"ja\",VLOOKUP($B17,$N$40:$U$278,5,0),\"Bitte wählen sie aus, ob sie zum Vorsteuerabzug berechtigt sind!\")),\"\")","v":""},"","",null,null,"",{"$nulls":23},{"$error":"#N/A"}]
[{"$f":"A17+1","v":4},null,{"$f":" IF(B18>0,CONCATENATE(VLOOKUP(B18,N40:W278,9,0),\" (\",VLOOKUP(B18,N40:W278,10,0),\")\"),\"\")","v":""},{"$f":"IF($B18>0,IF(Fahrzeuge!$C$6=\"nein\",VLOOKUP($B18,$N$40:$U$278,3,0),IF(Fahrzeuge!$C$6=\"ja\",VLOOKUP($B18,$N$40:$U$278,2,0),\"Bitte wählen sie aus, ob sie zum Vorsteuerabzug berechtigt sind!\")),\"\")","v":""},"",{"$f":"IF($B18>0,IF(Fahrzeuge!$C$6=\"nein\",VLOOKUP($B18,$N$40:$U$278,6,0),IF(Fahrzeuge!$C$6=\"ja\",VLOOKUP($B18,$N$40:$U$278,5,0),\"Bitte wählen sie aus, ob sie zum Vorsteuerabzug berechtigt sind!\")),\"\")","v":""},"","",null,null,"",{"$nulls":23},{"$error":"#N/A"}]
[{"$f":"A18+1","v":5},null,{"$f":" IF(B19>0,CONCATENATE(VLOOKUP(B19,N40:W278,9,0),\" (\",VLOOKUP(B19,N40:W278,10,0),\")\"),\"\")","v":""},{"$f":"IF($B19>0,IF(Fahrzeuge!$C$6=\"nein\",VLOOKUP($B19,$N$40:$U$278,3,0),IF(Fahrzeuge!$C$6=\"ja\",VLOOKUP($B19,$N$40:$U$278,2,0),\"Bitte wählen sie aus, ob sie zum Vorsteuerabzug berechtigt sind!\")),\"\")","v":""},"",{"$f":"IF($B19>0,IF(Fahrzeuge!$C$6=\"nein\",VLOOKUP($B19,$N$40:$U$278,6,0),IF(Fahrzeuge!$C$6=\"ja\",VLOOKUP($B19,$N$40:$U$278,5,0),\"Bitte wählen sie aus, ob sie zum Vorsteuerabzug berechtigt sind!\")),\"\")","v":""},"","",null,null,"",{"$nulls":23},{"$error":"#N/A"}]
[{"$f":"A19+1","v":6},null,{"$f":" IF(B20>0,CONCATENATE(VLOOKUP(B20,N40:W278,9,0),\" (\",VLOOKUP(B20,N40:W278,10,0),\")\"),\"\")","v":""},{"$f":"IF($B20>0,IF(Fahrzeuge!$C$6=\"nein\",VLOOKUP($B20,$N$40:$U$278,3,0),IF(Fahrzeuge!$C$6=\"ja\",VLOOKUP($B20,$N$40:$U$278,2,0),\"Bitte wählen sie aus, ob sie zum Vorsteuerabzug berechtigt sind!\")),\"\")","v":""},"",{"$f":"IF($B20>0,IF(Fahrzeuge!$C$6=\"nein\",VLOOKUP($B20,$N$40:$U$278,6,0),IF(Fahrzeuge!$C$6=\"ja\",VLOOKUP($B20,$N$40:$U$278,5,0),\"Bitte wählen sie aus, ob sie zum Vorsteuerabzug berechtigt sind!\")),\"\")","v":""},"","",null,null,"",{"$nulls":23},{"$error":"#N/A"}]
{"$rows_left_out":278}
{"sheet":"sonst. PKW u. LFZ","index":2,"n_rows":29,"n_cols":11,"rows_kept":29,"cut":false,"hidden":true,"merged":[[2,0,2,9],[3,0,3,9]]}
["Ermittlung der förderfähigen Ausgaben (EfA) für sonst. PKW u. LFZ",{"$nulls":9},{"$f":"IF(Fahrzeuge!$L$1=0, \" \",\"FKZ: 03EMI4\"&Fahrzeuge!$L$1)","v":" "}]
["Hinweise:"]
["Hierfür müssen Sie entsprechende Angebote für das E-Fahrzeug und ein Referenzfahrzeug eingeholt haben. Diese Angebote sind beizufügen."]
[{"$f":"IF(Fahrzeuge!C6=\"\",\"Bitte geben Sie auf der Registerkarte 'Fahrzeuge'  an, ob Sie zum Vorsteuerabzug berechtigt sind.\",\"\")","v":"Bitte geben Sie auf der Registerkarte 'Fahrzeuge'  an, ob Sie zum Vorsteuerabzug berechtigt sind."}]
[]
["Pos.","Typ E-Fahrzeug",{"$f":"IF(Fahrzeuge!$C$6=\"nein\",\"Bruttopreis\nE-Fahrzeug laut beigefügtem Angebot *\",IF(Fahrzeuge!$C$6=\"ja\",\"Nettopreis\nE-Fahrzeug laut beigefügtem Angebot *\",\"Bitte wählen sie aus, ob sie zum Vorsteuerabzug berechtigt sind!\"))","v":"Bitte wählen sie aus, ob sie zum Vorsteuerabzug berechtigt sind!"},"Typ Referenzfahrzeug",{"$f":"IF(Fahrzeuge!$C$6=\"nein\",\"Bruttopreis Referenzfahrzeug\nlaut beigefügtem Angebot *\",IF(Fahrzeuge!$C$6=\"ja\",\"Nettopreis Referenzfahrzeug\nlaut beigefügtem Angebot *\",\"Bitte wählen sie aus, ob sie zum Vorsteuerabzug berechtigt sind!\"))","v":"Bitte wählen sie aus, ob sie zum Vorsteuerabzug berechtigt sind!"},{"$f":"IF(Fahrzeuge!$C$6=\"nein\",\"Förderfähige Ausgaben pro Fahrzeug (brutto)\",IF(Fahrzeuge!$C$6=\"ja\",\"Förderfähige Ausgaben pro Fahrzeug (netto)\",\"Bitte wählen sie aus, ob sie zum Vorsteuerabzug berechtigt sind!\"))","v":"Bitte wählen sie aus, ob sie zum Vorsteuerabzug berechtigt sind!"},"Anzahl zu beschaffender Fahrzeuge des Typs","erwartete durchschnittliche Jahres-Fahrleistung in km*","* alternativ: erwartete Jahresbetriebs-stunden","Förderfähige Ausgaben ","Korrekturfeld PtJ"]
[1,{"$nulls":4},{"$f":"IF(B7>\"\",IF($A$4=\"\",C7-E7,$F$6),\"\")","v":""},null,null,null,{"$f":"IF(B7>\"\",F7*G7,\"\")","v":""}]
[]
[2,{"$nulls":4},{"$f":"IF(B9>\"\",IF($A$4=\"\",C9-E9,$F$6),\"\")","v":""},null,null,null,{"$f":"IF(B9>\"\",F9*G9,\"\")","v":""}]
[]
[3,{"$nulls":4},"",null,null,null,""]
[]
[4,{"$nulls":4},"",null,null,null,""]
[]
[5,{"$nulls":4},"",null,null,null,""]
[]
[6,{"$nulls":4},"",null,null,null,""]
[]
[7,{"$nulls":4},"",null,null,null,""]
[]
{"$rows_left_out":10}
{"sheet":"Ladeinfrastruktur","index":3,"n_rows":53,"n_cols":11,"rows_kept":53,"cut":false,"hidden":false,"merged":[[30,2,30,5],[31,2,31,5],[2,0,2,5],[27,2,27,5],[28,2,28,5],[29,2,29,5]]}
["Ermittlung der förderfähigen Ausgaben (EfA) - Pauschalen für Ladeinfrastruktur",{"$nulls":4},{"$f":"IF(Fahrzeuge!$L$1=0, \" \",\"FKZ: 03EMI4\"&Fahrzeuge!$L$1)","v":" "}]
[{"$f":"IF(Fahrzeuge!C6=\"\",\"Hinweis:\",\"\")","v":"Hinweis:"}]
[{"$f":"IF(Fahrzeuge!C6=\"\",\"Bitte geben Sie auf der Registerkarte 'Fahrzeuge'  an, ob Sie zum Vorsteuerabzug berechtigt sind\",\"\")","v":"Bitte geben Sie auf der Registerkarte 'Fahrzeuge'  an, ob Sie zum Vorsteuerabzug berechtigt sind"}]
[]
["Pos.","Typ Ladeinfrastruktur (LIS)*\n[Auswahlbox]",{"$f":"IF(Fahrzeuge!$C$6=\"nein\",\"Förderfähige Ausgaben pro Ladesäule (brutto)\",IF(Fahrzeuge!$C$6=\"ja\",\"Förderfähige Ausgaben pro Ladesäule (netto)\",\"Bitte wählen sie aus, ob sie zum Vorsteuerabzug berechtigt sind!\"))","v":"Bitte wählen sie aus, ob sie zum Vorsteuerabzug berechtigt sind!"},"Anzahl zu beschaffender Ladesäulen des Typs","Förderfähige Ausgaben ","Korrekturfeld PtJ"]
[1,null,{"$f":"IF($B6>0,IF(Fahrzeuge!$C$6=\"nein\",VLOOKUP($B6,$I$41:$K$53,3,0),IF(Fahrzeuge!$C$6=\"ja\",VLOOKUP($B6,$I$41:$K$53,2,0),\"Bitte wählen sie aus, ob sie zum Vorsteuerabzug berechtigt sind!\")),\"\")","v":""},null,{"$f":"IF(D6>0,C6*D6,\"\")","v":""}]
[]
[2,null,{"$f":"IF($B8>0,IF(Fahrzeuge!$C$6=\"nein\",VLOOKUP($B8,$I$41:$K$53,3,0),IF(Fahrzeuge!$C$6=\"ja\",VLOOKUP($B8,$I$41:$K$53,2,0),\"Bitte wählen sie aus, ob sie zum Vorsteuerabzug berechtigt sind!\")),\"\")","v":""},null,{"$f":"IF(D8>0,C8*D8,\"\")","v":""}]
[]
[3,null,{"$f":"IF($B10>0,IF(Fahrzeuge!$C$6=\"nein\",VLOOKUP($B10,$I$41:$K$53,3,0),IF(Fahrzeuge!$C$6=\"ja\",VLOOKUP($B10,$I$41:$K$53,2,0),\"Bitte wählen sie aus, ob sie zum Vorsteuerabzug berechtigt sind!\")),\"\")","v":""},null,{"$f":"IF(D10>0,C10*D10,\"\")","v":""}]
[]
[4,null,{"$f":"IF($B12>0,IF(Fahrzeuge!$C$6=\"nein\",VLOOKUP($B12,$I$41:$K$53,3,0),IF(Fahrzeuge!$C$6=\"ja\",VLOOKUP($B12,$I$41:$K$53,2,0),\"Bitte wählen sie aus, ob sie zum Vorsteuerabzug berechtigt sind!\")),\"\")","v":""},null,{"$f":"IF(D12>0,C12*D12,\"\")","v":""}]
[]
[5,null,{"$f":"IF($B14>0,IF(Fahrzeuge!$C$6=\"nein\",VLOOKUP($B14,$I$41:$K$53,3,0),IF(Fahrzeuge!$C$6=\"ja\",VLOOKUP($B14,$I$41:$K$53,2,0),\"Bitte wählen sie aus, ob sie zum Vorsteuerabzug berechtigt sind!\")),\"\")","v":""},null,{"$f":"IF(D14>0,C14*D14,\"\")","v":""}]
[]
[6,null,{"$f":"IF($B16>0,IF(Fahrzeuge!$C$6=\"nein\",VLOOKUP($B16,$I$41:$K$53,3,0),IF(Fahrzeuge!$C$6=\"ja\",VLOOKUP($B16,$I$41:$K$53,2,0),\"Bitte wählen sie aus, ob sie zum Vorsteuerabzug berechtigt sind!\")),\"\")","v":""},null,{"$f":"IF(D16>0,C16*D16,\"\")","v":""}]
[]
[7,null,{"$f":"IF($B18>0,IF(Fahrzeuge!$C$6=\"nein\",VLOOKUP($B18,$I$41:$K$53,3,0),IF(Fahrzeuge!$C$6=\"ja\",VLOOKUP($B18,$I$41:$K$53,2,0),\"Bitte wählen sie aus, ob sie zum Vorsteuerabzug berechtigt sind!\")),\"\")","v":""},null,{"$f":"IF(D18>0,C18*D18,\"\")","v":""}]
[]
[8,null,{"$f":"IF($B20>0,IF(Fahrzeuge!$C$6=\"nein\",VLOOKUP($B20,$I$41:$K$53,3,0),IF(Fahrzeuge!$C$6=\"ja\",VLOOKUP($B20,$I$41:$K$53,2,0),\"Bitte wählen sie aus, ob sie zum Vorsteuerabzug berechtigt sind!\")),\"\")","v":""},null,{"$f":"IF(D20>0,C20*D20,\"\")","v":""}]
{"$rows_left_out":27}
{"sheet":"spezielle Ladeinfrastruktur","index":4,"n_rows":27,"n_cols":6,"rows_kept":27,"cut":false,"hidden":true,"merged":[[27,0,27,5],[2,0,2,6],[0,0,0,3]]}
["Ermittlung der förderfähigen Ausgaben für Ladeinfrastruktur, die nicht in der Registerkarte \"Ladeinfrastruktur\" aufgeführt wird",{"$nulls":4},{"$f":"IF(Fahrzeuge!$L$1=0, \" \",\"FKZ: 03EMI4\"&Fahrzeuge!$L$1)","v":" "}]
["Hinweise:"]
["Hierfür müssen Sie entsprechende Angebote für die Ladeinfrastruktur eingeholt haben. Diese Angebote sind beizufügen."]
[{"$f":"IF(Fahrzeuge!C6=\"\",\"Bitte geben Sie auf der Registerkarte 'Fahrzeuge'  an, ob Sie zum Vorsteuerabzug berechtigt sind\",\"\")","v":"Bitte geben Sie auf der Registerkarte 'Fahrzeuge'  an, ob Sie zum Vorsteuerabzug berechtigt sind"}]
[]
["Pos.","Typ Ladeinfrastruktur (LIS)",{"$f":"IF(Fahrzeuge!$C$6=\"nein\",\"Bruttopreis LIS laut beigefügtem Angebot *\",IF(Fahrzeuge!$C$6=\"ja\",\"Nettopreis LIS laut beigefügtem Angebot *\",\"Bitte wählen sie aus, ob sie zum Vorsteuerabzug berechtigt sind!\"))","v":"Bitte wählen sie aus, ob sie zum Vorsteuerabzug berechtigt sind!"},"Anzahl zu beschaffender LIS dieses Typs","Förderfähige Ausgaben ","Korrekturfeld PtJ"]
[1,null,null,null,{"$f":"IF(C7>0,D7*C7,\"\")","v":""}]
[]
[2,null,null,null,{"$f":"IF(C9>0,D9*C9,\"\")","v":""}]
[]
[3,null,null,null,{"$f":"IF(C11>0,D11*C11,\"\")","v":""}]
[]
[4,null,null,null,{"$f":"IF(C13>0,D13*C13,\"\")","v":""}]
[]
[5,null,null,null,{"$f":"IF(C15>0,D15*C15,\"\")","v":""}]
[]
[6,null,null,null,{"$f":"IF(C17>0,D17*C17,\"\")","v":""}]
[]
[7,null,null,null,{"$f":"IF(C19>0,D19*C19,\"\")","v":""}]
[]
{"$rows_left_out":8}
{"sheet":"Vorlage für AZA","index":5,"n_rows":80,"n_cols":7,"rows_kept":80,"cut":false,"hidden":false,"merged":[[1,0,1,4],[5,0,5,4],[8,0,8,4],[63,2,63,4],[64,2,64,4]]}
["Hinweis:",null,null,null,{"$f":"IF(Fahrzeuge!$L$1=0, \" \",\"FKZ: 03EMI4\"&Fahrzeuge!$L$1)","v":" "}]
["Vorlage zum Übertragen der Daten aus dieser Tabelle in den AZA-Antrag in easy-Online. "]
["Bitte kopieren Sie die Bezeichung wie hier dargestellt in das easy-Online-Formular. "]
["Die Anzahl der zu beschaffenden Fahrzeuge/ Ladeinfrastruktur muss ggf. auf die Anschaffungsjahre aufgeteilt werden."]
["Beachten Sie, dass die hier angegebene Summe mit den Gesamtmitteln im easy-Online-Antrag überein stimmen müssen."]
[{"$f":"IF(Fahrzeuge!$C$6=\"nein\",\"Der Antragsteller ist nicht zum Vorsteuerabzug berechtigt.\",IF(Fahrzeuge!$C$6=\"ja\",\"Der Antragsteller ist zum Vorsteuerabzug berechtigt.\",\"Bitte wählen sie aus, ob sie zum Vorsteuerabzug berechtigt sind!\"))","v":"Bitte wählen sie aus, ob sie zum Vorsteuerabzug berechtigt sind!"}]
["(sollte diese Aussage nicht zutreffen, wählen Sie bitte die entsprechende Option auf der Registerkarte \"Fahrzeuge\")"]
[]
["Gesamtfinanzierung - Gegenstände und andere Investitionen von mehr als 800 € im Einzelfall"]
[]
["lfd. Nr.","Bezeichnung","Zuwendungsfähige\nAusgaben / Stück","Anzahl","F0833 Betrag €"]
[{"$f":"IF(Fahrzeuge!$B15>\"\",Fahrzeuge!A15,0)","v":0},{"$f":"IF(Fahrzeuge!$B15>\"\",CONCATENATE(Fahrzeuge!AI15,\" \",Fahrzeuge!B15),\"\")","v":""},{"$f":"IF(Fahrzeuge!$B15>\"\",Fahrzeuge!G15,\"\")","v":""},{"$f":"IF(Fahrzeuge!$B15>\"\",Fahrzeuge!I15,\"\")","v":""},{"$f":"IF(Fahrzeuge!$B15>\"\",Fahrzeuge!K15,\"\")","v":""}]
[{"$f":"IF(Fahrzeuge!B16>\"\",Fahrzeuge!A16,A12)","v":0},{"$f":"IF(Fahrzeuge!$B16>\"\",CONCATENATE(Fahrzeuge!AI16,\" \",Fahrzeuge!B16),\"\")","v":""},{"$f":"IF(Fahrzeuge!$B16>\"\",Fahrzeuge!G16,\"\")","v":""},{"$f":"IF(Fahrzeuge!$B16>\"\",Fahrzeuge!I16,\"\")","v":""},{"$f":"IF(Fahrzeuge!$B16>\"\",Fahrzeuge!K16,\"\")","v":""}]
[{"$f":"IF(Fahrzeuge!B17>\"\",Fahrzeuge!A17,A13)","v":0},{"$f":"IF(Fahrzeuge!$B17>\"\",CONCATENATE(Fahrzeuge!AI17,\" \",Fahrzeuge!B17),\"\")","v":""},{"$f":"IF(Fahrzeuge!$B17>\"\",Fahrzeuge!G17,\"\")","v":""},{"$f":"IF(Fahrzeuge!$B17>\"\",Fahrzeuge!I17,\"\")","v":""},{"$f":"IF(Fahrzeuge!$B17>\"\",Fahrzeuge!K17,\"\")","v":""}]
[{"$f":"IF(Fahrzeuge!B18>\"\",Fahrzeuge!A18,A14)","v":0},{"$f":"IF(Fahrzeuge!$B18>\"\",CONCATENATE(Fahrzeuge!AI18,\" \",Fahrzeuge!B18),\"\")","v":""},{"$f":"IF(Fahrzeuge!$B18>\"\",Fahrzeuge!G18,\"\")","v":""},{"$f":"IF(Fahrzeuge!$B18>\"\",Fahrzeuge!I18,\"\")","v":""},{"$f":"IF(Fahrzeuge!$B18>\"\",Fahrzeuge!K18,\"\")","v":""}]
[{"$f":"IF(Fahrzeuge!B19>\"\",Fahrzeuge!A19,A15)","v":0},{"$f":"IF(Fahrzeuge!$B19>\"\",CONCATENATE(Fahrzeuge!AI19,\" \",Fahrzeuge!B19),\"\")","v":""},{"$f":"IF(Fahrzeuge!$B19>\"\",Fahrzeuge!G19,\"\")","v":""},{"$f":"IF(Fahrzeuge!$B19>\"\",Fahrzeuge!I19,\"\")","v":""},{"$f":"IF(Fahrzeuge!$B19>\"\",Fahrzeuge!K19,\"\")","v":""}]
[{"$f":"IF(Fahrzeuge!B20>\"\",Fahrzeuge!A20,A16)","v":0},{"$f":"IF(Fahrzeuge!$B20>\"\",CONCATENATE(Fahrzeuge!AI20,\" \",Fahrzeuge!B20),\"\")","v":""},{"$f":"IF(Fahrzeuge!$B20>\"\",Fahrzeuge!G20,\"\")","v":""},{"$f":"IF(Fahrzeuge!$B20>\"\",Fahrzeuge!I20,\"\")","v":""},{"$f":"IF(Fahrzeuge!$B20>\"\",Fahrzeuge!K20,\"\")","v":""}]
[{"$f":"IF(Fahrzeuge!B21>\"\",Fahrzeuge!A21,A17)","v":0},{"$f":"IF(Fahrzeuge!$B21>\"\",CONCATENATE(Fahrzeuge!AI21,\" \",Fahrzeuge!B21),\"\")","v":""},{"$f":"IF(Fahrzeuge!$B21>\"\",Fahrzeuge!G21,\"\")","v":""},{"$f":"IF(Fahrzeuge!$B21>\"\",Fahrzeuge!I21,\"\")","v":""},{"$f":"IF(Fahrzeuge!$B21>\"\",Fahrzeuge!K21,\"\")","v":""}]
[{"$f":"IF(Fahrzeuge!B22>\"\",Fahrzeuge!A22,A18)","v":0},{"$f":"IF(Fahrzeuge!$B22>\"\",CONCATENATE(Fahrzeuge!AI22,\" \",Fahrzeuge!B22),\"\")","v":""},{"$f":"IF(Fahrzeuge!$B22>\"\",Fahrzeuge!G22,\"\")","v":""},{"$f":"IF(Fahrzeuge!$B22>\"\",Fahrzeuge!I22,\"\")","v":""},{"$f":"IF(Fahrzeuge!$B22>\"\",Fahrzeuge!K22,\"\")","v":""}]
[{"$f":"IF(Fahrzeuge!B23>\"\",Fahrzeuge!A23,A19)","v":0},{"$f":"IF(Fahrzeuge!$B23>\"\",CONCATENATE(Fahrzeuge!AI23,\" \",Fahrzeuge!B23),\"\")","v":""},{"$f":"IF(Fahrzeuge!$B23>\"\",Fahrzeuge!G23,\"\")","v":""},{"$f":"IF(Fahrzeuge!$B23>\"\",Fahrzeuge!I23,\"\")","v":""},{"$f":"IF(Fahrzeuge!$B23>\"\",Fahrzeuge!K23,\"\")","v":""}]
{"$rows_left_out":60}